This section lists all the changes in the selected update release.

Issue
Priority
Title
Component
JDK-6913047 3 Long term memory leak when using PKCS11 and JCE exceeds 32 bit process address space security-libs / javax.crypto:pkcs11
JDK-8139178 4 Wrong fontMetrics when printing in Landscape (OpenJDK) client-libs / 2d
JDK-8163805 4 hotspot/test/serviceability/sa/sadebugd/SADebugDTest.java failed with timed out hotspot / svc-agent
JDK-8170494 3 JNI exception pending in PlainDatagramSocketImpl.c core-libs / java.net
JDK-8172695 3 (scanner) java/util/Scanner/ScanTest.java fails core-libs / java.util
JDK-8174691 3 [TESTBUG] A number of native hotspot unit tests fail when executed in stand-alone mode hotspot / test
JDK-8179098 3 Crypto AES/ECB encryption/decryption performance regression (introduced in jdk9b73) security-libs / javax.crypto
JDK-8181143 4 Introduce diagnostic flag to abort VM on too long VM operations hotspot / runtime
JDK-8188133 3 C2: Static field accesses in clinit can trigger deoptimizations hotspot
JDK-8190361 3 Incorrect version info in jaccessinspector.exe and jaccesswalker.exe client-libs
JDK-8195793 3 Remove GTE CyberTrust Global Root security-libs / java.security
JDK-8201317 4 X25519/X448 code improvements security-libs / javax.crypto
JDK-8200613 3 SA: jstack throws UnmappedAddressException with a CDS core file hotspot
JDK-8200286 3 (testbug) MOptionTest test fails with java.lang.AssertionError: Classfiles too old! tools / javac
JDK-8201633 3 Problems with AES-GCM native acceleration security-libs / javax.crypto
JDK-8202794 4 Native Unix code should use readdir rather than readdir_r core-libs
JDK-8202651 3 Test ComodoCA.java fails security-libs / java.security
JDK-8202414 3 Unsafe write after primitive array creation may result in array length change hotspot
JDK-8202353 4 os::readdir should use readdir instead of readdir_r hotspot / runtime
JDK-8202835 3 jfr/event/os/TestSystemProcess.java fails on missing events hotspot / runtime
JDK-8202884 3 SA: Attach/detach might fail on Linux if debugee application create/destroy threads during attaching hotspot / svc-agent
JDK-8203627 2 Swing applications with JRadioButton and JCheckbox fail to render correctly when using GTK3 and the GTK L&F client-libs
JDK-8205574 3 Loop predication "assert(f <= 1 && f >= 0) failed Incorrect frequency" hotspot / compiler
JDK-8204308 3 SA: serviceability/sa/TestInstanceKlassSize*.java fails when running in CDS mode hotspot / svc-agent
JDK-8205432 3 Replace the placeholder Japanese era name core-libs / java.util:i18n
JDK-8206120 3 Add test cases for lenient Japanese era parsing core-libs / java.util:i18n
JDK-8205611 3 Improve the wording of LinkageErrors to include module and class loader information hotspot / runtime
JDK-8207760 4 SAXException: Invalid UTF-16 surrogate detected: d83c ? xml / javax.xml.transform
JDK-8207748 1 Fix for 8202794 breaks tier1 builds core-libs
JDK-8207340 4 (fs) UnixNativeDispatcher close and readdir usages should be fixed core-libs / java.nio
JDK-8206955 4 MethodHandleProxies.asInterfaceInstance does not support default methods core-libs / java.lang.invoke
JDK-8208656 4 Move java/util/Calendar/CalendarTestScripts tests into OpenJDK core-libs / java.util:i18n
JDK-8208648 4 ECC Field Arithmetic Enhancements security-libs / javax.crypto
JDK-8208634 4 Add x-IBM-1129 charset core-libs / java.nio.charsets
JDK-8208698 4 Improved ECC Implementation security-libs / javax.crypto
JDK-8208996 3 X11 icon window color handing bug client-libs
JDK-8208702 3 javax/swing/reliability/HangDuringStaticInitialization.java may hang on macos client-libs
JDK-8209414 3 AArch64: method handle invocation does not respect JVMTI interp_only mode hotspot / svc
JDK-8209055 3 c.s.t.javac.code.DeferredCompletionFailureHandler seems to use WeakHashMap incorrectly tools / javac
JDK-8209415 4 Fix JVMTI test failure HS202 hotspot / jvmti
JDK-8209573 4 [TESTBUG] gc/epsilon/TestMemoryMXBeans should retry on failure hotspot
JDK-8210008 4 custom extension for make/SourceRevision.gmk infrastructure / build
JDK-8209951 3 Problematic sparc intrinsic: com.sun.crypto.provider.CipherBlockChaining hotspot / compiler
JDK-8209914 3 javadoc search sometimes generates bad URIs tools / javadoc(tool)
JDK-8210192 4 Hsperf counter ParNew::CMS should be ParNew:CMS hotspot / gc
JDK-8210320 4 PPC64: Fix uninitialized variable in C1 LIR assembler code hotspot / compiler
JDK-8210283 3 Support git as an SCM alternative in the build infrastructure / build
JDK-8210197 3 javac can't tell during speculative attribution if a diamond expression is creating an anonymous inner class or not tools / javac
JDK-8210483 2 AssertionError in DeferredAttr at setOverloadKind caused by JDK-8203679 tools / javac
JDK-8210457 3 JVM crash in ResolvedMethodTable::add_method(Handle) hotspot / runtime
JDK-8210633 4 Cannot parse JapaneseDate string with DateTimeFormatterBuilder Mapped-values core-libs / java.time
JDK-8210519 2 build/releaseFile/CheckSource.java failed additional sources found infrastructure / build
JDK-8210739 3 Calling JSpinner's setFont with null throws NullPointerException client-libs / javax.swing
JDK-8210837 3 Add libXrandr-devel to the Linux devkits infrastructure / build
JDK-8210803 3 Compilation failure in codeBlob.cpp for Windows 32-bit hotspot / compiler
JDK-8210782 2 Upgrade HarfBuzz to the latest 2.3.1 client-libs
JDK-8210886 3 Remove references in xwindows.md to non-existent files. client-libs / java.awt
JDK-8210880 3 Remove HPKeysym.h from JDK sources client-libs / java.awt
JDK-8210863 3 Remove Xrandr include files from JDK sources client-libs / java.awt
JDK-8210899 3 (zipfs) ZipFileSystem.EntryOutputStreamCRC32 mistakenly set the crc32 value into size field core-libs / java.nio
JDK-8211266 3 (zipfs) [TESTBUG] ZipFSTester.java failed intermittently in ZipFSTester.checkRead(): bound must be positive core-libs / java.nio
JDK-8211100 2 hotspot C1 issue with comparing long numbers on x86 32-bit hotspot / compiler
JDK-8211064 2 [AArch64] Interpreter and c1 don't correctly handle jboolean results in native calls hotspot / runtime
JDK-8211320 3 AArch64: unsafe.compareAndSetByte() and unsafe.compareAndSetShort() c2 intrinsics broken with negative expected value hotspot / compiler
JDK-8211398 3 Square character support for the Japanese new era core-libs / java.util:i18n
JDK-8211393 3 Memory leak issue on awt_InputMethod.c client-libs
JDK-8211350 4 Remove jprt support infrastructure / build
JDK-8211698 2 Crash in C2 compiled code during execution of double array heavy processing code hotspot / compiler
JDK-8211435 3 Exception in thread "AWT-EventQueue-1" java.lang.IllegalArgumentException: null source client-libs / java.awt
JDK-8211826 3 StringIndexOutOfBoundsException happens via GetStringUTFRegion() client-libs
JDK-8211810 4 X11 Time stamp data should be unsigned client-libs
JDK-8211969 3 test/jdk/lib/security/CheckBlacklistedCerts.java searching for wrong paths security-libs / java.security
JDK-8211841 4 [testbug] sun/nio/cs/OLD/TestIBMDB.java does not compile (aix) core-libs / java.nio.charsets
JDK-8211971 4 Move security/cacerts/VerifyCACerts.java and security/CheckBlacklistedCerts.java security-libs / java.security
JDK-8212205 2 VM asserts after CDS archive has been unmapped hotspot
JDK-8212202 3 [Windows] Exception if no printers are installed. client-libs / 2d
JDK-8212676 3 AWT SystemColor setting on CDE client-libs / java.awt
JDK-8212562 4 To remove lib/security from test/jdk/TEST.groups security-libs / java.security
JDK-8212794 3 IBM-964 is required for AIX default charset core-libs / java.nio.charsets
JDK-8212678 3 Windows IME related patch client-libs / java.awt
JDK-8212677 3 X11 default visual support for IM status window on VNC client-libs
JDK-8212828 4 (process) Provide a way for Runtime.exec to use posix_spawn on linux core-libs / java.lang
JDK-8213232 3 Unix/X11 setCompositionEnableNative issue client-libs / java.awt
JDK-8213213 4 Remove src/java.desktop/unix/classes/sun/awt/X11/keysym2ucs.h client-libs / java.awt
JDK-8213015 4 Inconsistent settings between JFR.configure and -XX:FlightRecorderOptions hotspot / jfr
JDK-8213292 2 Input freezes after MacOS key-selector (press&hold) usage on macOS Mojave client-libs / java.awt
JDK-8213294 3 Upgrade IANA LSR data core-libs / java.util:i18n
JDK-8213515 4 Improve freetype detection on linux/ppc64/ppc64le/s390x infrastructure / build
JDK-8213614 3 DnD operation change feature does not work with 64bit big endian CPU client-libs
JDK-8213618 3 IBM970 charset has missing entry and remove unexpected entries core-libs / java.nio.charsets
JDK-8213617 3 JFR should record the PID of the recorded process hotspot / jfr
JDK-8213825 2 assert(false) failed: Non-balanced monitor enter/exit! Likely JNI locking hotspot / compiler
JDK-8213944 2 Fix AIX build after the removal of Xrandr.h and add a configure check for it client-libs / java.awt
JDK-8214109 3 XToolkit is not correctly displayed color on 16-bit high color setting client-libs
JDK-8214002 3 Cannot use italic font style if the font has embedded bitmap client-libs
JDK-8214111 3 There is no icon in all JOptionPane target image client-libs
JDK-8214122 3 JDWP is broken on 32 bit Windows: transport library missing onLoad entry core-svc / debugger
JDK-8214112 3 The whole text in target JPasswordField image are not selected. client-libs / javax.swing
JDK-8214252 3 Expanded & Collapsed nodes of a JTree look the same on GTK3 client-libs
JDK-8214253 3 Tooltip is transparent rather than having a black background client-libs / javax.swing
JDK-8214468 3 jQuery UI upgrade from 1.11.4 to 1.12.1 tools
JDK-8214533 3 IBM-29626C is required for AIX default charset core-libs / java.nio.charsets
JDK-8214765 3 All TrayIcon MessageType icons does not show up with gtk3 option set client-libs
JDK-8214935 2 Upgrade IANA LSR data core-libs / java.util:i18n
JDK-8215123 3 Crash in runtime image built with jlink --compress=2 tools / jlink
JDK-8215026 3 Incorrect amount of memory unmapped with ImageFileReader::close() tools / jlink
JDK-8215284 3 Reduce noise induced by periodic task getFileSize() hotspot / jfr
JDK-8215342 3 [Zero] Build fails after JDK-8200613 hotspot / runtime
JDK-8215296 3 do not disable c99 on Solaris infrastructure / build
JDK-8215364 3 JavaFX crashes on Ubuntu 18.04 with Wayland while using Swing-FX interop client-libs
JDK-8215374 1 32-bit build failures after JDK-8181143 (Introduce diagnostic flag to abort VM on too long VM operations) hotspot
JDK-8215398 4 -Xlog option usage => Invalid decorator '\temp\app_cds.log'. hotspot
JDK-8215443 3 The use of TransportContext.fatal() leads to bad coding style security-libs / javax.net.ssl
JDK-8215757 2 C2: PhaseIdealLoop::create_new_if_for_predicate() computes wrong IDOM hotspot
JDK-8215790 3 Delegated task created by SSLEngine throws java.nio.BufferUnderflowException security-libs / javax.net.ssl
JDK-8215472 4 (zipfs) Cleanups in implementation classes of jdk.zipfs and tests core-libs / java.nio
JDK-8215707 4 [macosx] fix pthread_getschedparam and pthread_setschedparam calls hotspot / runtime
JDK-8216355 4 missing NULL checks in libnet in interface iteration and potential resource leak in getMacAddress core-libs / java.net
JDK-8216350 3 AArch64: monitor unlock fast path not called hotspot / compiler
JDK-8216045 2 The size of key_exchange may be wrong on FFDHE security-libs / javax.net.ssl
JDK-8215951 2 AArch64: jtreg test vmTestbase/nsk/jvmti/PopFrame/popframe005 segfaults hotspot / jvmti
JDK-8216597 2 SIGBUS in Java_sun_security_pkcs11_wrapper_PKCS11_getNativeKeyInfo after JDK-6913047 security-libs / javax.crypto:pkcs11
JDK-8216577 2 Add GlobalSign's R6 Root certificate security-libs / java.security
JDK-8216556 4 Unnecessary liveness computation with JVMTI hotspot / compiler
JDK-8217088 2 Disable JDK-6913047 fix (SunPKCS11 memory leak) after JDK-8216597 (SIGBUS error in getNativeKeyInfo) security-libs
JDK-8216970 3 condy causes JVM crash hotspot
JDK-8217263 3 Automate DashOffset test client-libs
JDK-8217094 3 HttpClient SSL race if a socket IOException is raised before ALPN is available core-libs
JDK-8217311 4 Improve Exception thrown when MulticastSocket.setInterface fails on AIX(Unix) core-libs / java.net
JDK-8217647 3 JFR: recordings on 32-bit systems unreadable hotspot / jfr
JDK-8217609 3 New era placeholder not recognized by java.text.SimpleDateFormat core-libs / java.util:i18n
JDK-8217564 3 idempotent protection missing in crc32c.h hotspot / compiler
JDK-8217707 3 JNICALL declaration breaks Splash screen functions client-libs / 2d
JDK-8217690 2 Update public suffix version security-libs / java.security
JDK-8217765 2 Internal Error (javaCalls.cpp:61) guarantee(thread->can_call_java()) failed hotspot
JDK-8217786 3 Provide virtualization related info in the hs_error file on linux s390x hotspot / runtime
JDK-8217878 2 ENVELOPING XML signature no longer works security-libs / javax.xml.crypto
JDK-8217879 4 hs_err should print more instructions in hex dump hotspot / runtime
JDK-8217880 3 AIX build issue after JDK-8214533 core-libs / java.nio.charsets
JDK-8218020 2 Fix version number in mesa.md 3rd party legal file client-libs
JDK-8218063 1 JDK-8218060 breaks build for S390 hotspot / gc
JDK-8218152 3 [javac] fails and exits with no error if a bad annotation processor provided tools / javac
JDK-8218060 1 JDK-8217786 breaks build due to remaining unused function hotspot / gc
JDK-8218469 2 JSlider display issue with slider for GTKLookAndFeel client-libs
JDK-8218470 2 JScrollBar display issue with GTKLookAndFeel client-libs
JDK-8218472 2 JProgressBar display issue with GTKLookAndFeel client-libs
JDK-8218479 2 JTextPane display issue with GTKLookAndFeel client-libs
JDK-8218473 2 JOptionPane display issue with GTKLookAndFeel client-libs
JDK-8218618 3 Program fails when using JDK addressed by UNC path and using Security Manager security-libs / java.security
JDK-8218629 3 XML Digital Signature throws NAMESPACE_ERR exception on OpenJDK 11, works 8/9/10 security-libs / javax.xml.crypto
JDK-8218674 3 HTML Tooltip with "img src=" on component doesn't show client-libs / javax.swing
JDK-8218733 4 SA: CollectedHeap provides broken implementation for used() and capacity() hotspot
JDK-8218781 3 Localized names for Japanese Era Reiwa in COMPAT provider core-libs / java.util:i18n
JDK-8218811 4 replace open by os::open in hotspot coding hotspot / runtime
JDK-8218915 4 Change isJavaIdentifierStart and isJavaIdentifierPart to handle new code points core-libs / java.lang
JDK-8218854 4 FontMetrics.getMaxAdvance may be less than the maximum FontMetrics.charWidth client-libs / 2d
JDK-8218991 4 s390: Add intrinsic for GHASH algorithm hotspot / compiler
JDK-8218960 3 CONFIG level logging statements printed in CLDRCalendarDataProviderImpl.java even when default log Level is INFO core-libs / java.util:i18n
JDK-8219011 4 Implement MacroAssembler::warn method on AArch64 hotspot
JDK-8219112 4 name_and_sig_as_C_string usages in frame_s390 miss ResourceMark hotspot / runtime
JDK-8219335 3 "failed: unexpected type" assert failure in ConnectionGraph::split_unique_types() with unsafe accesses hotspot
JDK-8219006 4 AArch64: Register corruption in slow subtype check hotspot / compiler
JDK-8219460 4 ppc: adjust NativeGeneralJump::insert_unconditional to stack allocated MacroAssembler hotspot / runtime
JDK-8219414 4 SA: jhsdb jsnap throws UnmappedAddressException with core generated by gcore hotspot / svc-agent
JDK-8219389 3 Delegated task created by SSLEngine throws BufferUnderflowException security-libs / javax.net.ssl
JDK-8219448 2 split-if update_uses accesses stale idom data hotspot / compiler
JDK-8219582 3 PPC: Crash after C1 checkcast patched and GC hotspot / compiler
JDK-8219574 4 Minimal VM build failure after JDK-8219414 hotspot / runtime
JDK-8219566 4 JFR did not collect call stacks when MaxJavaStackTraceDepth is set to zero hotspot / jfr
JDK-8219584 4 Try to dump error file by thread which causes safepoint timeout hotspot / runtime
JDK-8219650 3 [TESTBUG] Fix crashes in new test hotspot gtest "test_print_hex_dump" hotspot / runtime
JDK-8219651 4 compiler/ciReplay/TestServerVM.java is failing on windows hotspot / compiler
JDK-8219698 4 aarch64: SIGILL triggered when specifying unsupported hardware features hotspot / runtime
JDK-8219714 4 [testbug] com/sun/jdi/RedefineNestmateAttr/TestNestmateAttr.java must pass classpath to subprocess hotspot / svc
JDK-8219746 3 Provide virtualization related info in the hs_error file on linux ppc64 / ppc64le hotspot / runtime
JDK-8219710 4 Bump update version for OpenJDK: jdk11.0.5 infrastructure / release_eng
JDK-8219789 4 [TESTBUG] TestOptionsWithRanges.java produces hs_err_pidXXXXX.log file for VMThreadStackSize=9007199254740991 hotspot / runtime
JDK-8219890 3 Calendar.getDisplayName() returns empty string for new Japanese Era on some locales core-libs / java.util:i18n
JDK-8219918 4 ProblemList hotspot tests failing in SAP testing. hotspot / test
JDK-8219915 4 [TESTBUG] Fix test langtools/tools/javac/processing/model/completionfailure/SymbolsDontCumulate.java in standalone mode tools / javac
JDK-8220165 2 Encryption using GCM results in RuntimeException: input length out of bound security-libs / javax.crypto
JDK-8220166 4 Performance regression in deserialization (4-6% in SPECjbb) core-libs / java.io:serialization
JDK-8220198 3 Lots of com/sun/crypto/provider/Cipher tests fail on x86_32 due to missing SHA512 stubs hotspot
JDK-8220293 2 Deadlock in JFR string pool hotspot / jfr
JDK-8220283 4 ZGC fails to build on GCC 4.4.7: ATTRIBUTE_ALIGNED compatibility issue hotspot / runtime
JDK-8220281 3 IBM-858 alias name is missing on IBM00858 charset core-libs / java.nio.charsets
JDK-8220294 4 ZGC fails to build on GCC 4.4.7: Type parameter issue hotspot / gc
JDK-8220349 3 The fix done for JDK-8214253 have caused issues in JTree behaviour client-libs / javax.swing
JDK-8220353 3 [TESTBUG] TestRegisterRestoring uses SafepointALot without UnlockDiagnosticVMOptions hotspot / test
JDK-8220495 2 Update GIFlib library to the 5.1.8 client-libs / java.awt
JDK-8220513 4 Wrapper Key may get deleted when closing sessions in SunPKCS11 crypto provider security-libs / javax.crypto:pkcs11
JDK-8220374 3 C2: LoopStripMining doesn't strip as expected hotspot / compiler
JDK-8220441 3 [PPC64] Clobber memory effect missing for memory barriers in atomics hotspot / runtime
JDK-8220714 3 C2 Compilation failure when accessing off-heap memory using Unsafe hotspot / compiler
JDK-8220625 3 tools/javac/classreader/8171132/BadConstantValue.java failed with "did not see expected error" tools / javac
JDK-8220707 4 [TESTBUG] serviceability/sa/TestHeapDumpForLargeArray.java fails with jtreg -vmoption:-Xmx < 8g hotspot / svc-agent
JDK-8220718 3 Missing ResourceMark in nmethod::metadata_do hotspot / runtime
JDK-8220781 4 linux-s390 : os::get_summary_cpu_info gives bad output hotspot / runtime
JDK-8221175 4 Fix bad function case for controlled JVM crash on PPC64 big-endian hotspot / runtime
JDK-8221083 2 [ppc64] Wrong oop compare in C1-generated code hotspot / compiler
JDK-8220794 4 PPC64: Fix signal handler for SIGSEGV on branch to illegal address hotspot / runtime
JDK-8221304 3 Problem list java/awt/FontMetrics/MaxAdvanceIsMax.java client-libs / 2d
JDK-8221244 3 Unexpected behavior of PropertyDescription.getReadMethod for boolean properties client-libs / java.beans
JDK-8221263 3 [TEST_BUG] RemotePrinterStatusRefresh test is hard to use client-libs / 2d
JDK-8221412 3 lookupPrintServices() does not always update the list of Windows remote printers client-libs / 2d
JDK-8221318 4 [11u] do not disable c99 on Solaris infrastructure / build
JDK-8221400 4 java/lang/String/StringRepeat.java test requests too much heap core-libs / java.lang
JDK-8221401 4 java/math/BigInteger/LargeValueExceptions.java test should be disabled on 32-bit platforms core-libs / java.math
JDK-8221437 3 assert(java_lang_invoke_ResolvedMethodName::vmtarget(resolved_method()) == m()) failed: Should not change after link resolution hotspot / runtime
JDK-8221479 4 [s390] Fix JFR profiling hotspot
JDK-8221470 4 Print methods in exception messages in java-like Syntax. hotspot
JDK-8221483 4 TestOopCmp.java fails due to "Multiple garbage collectors selected" hotspot / compiler
JDK-8221535 3 add steal tick related information to hs_error file [linux] hotspot / runtime
JDK-8221610 4 Resurrect (legacy) JRE bundle target infrastructure / build
JDK-8221639 4 [i386] expand_exec_shield_cs_limit workaround is undefined code after JDK-8199717 hotspot / runtime
JDK-8221833 4 Readability check in Symbol::is_valid not performed for some addresses hotspot / runtime
JDK-8221769 4 Revert JDK-8221767 mistakenly pushed to jdk11u 11.0.3 xml / javax.xml.transform
JDK-8221915 4 cleanup ticks related coding in os_perf_aix.cpp [aix] hotspot / svc
JDK-8221917 4 serviceability/sa/TestPrintMdo.java fails on 32-bit platforms hotspot
JDK-8221880 4 Better customization for Windows RC properties FileDescription and ProductName infrastructure / build
JDK-8221870 4 use driver to run CtwRunner in applications/ctw tests hotspot / compiler
JDK-8222027 4 TEST_BUG: java/util/logging/LogManager/TestLoggerNames.java generates intermittent ClassCastException core-libs / java.util.logging
JDK-8222032 3 x86_32 fails with "wrong size of mach node" on AVX-512 machine hotspot / compiler
JDK-8221924 3 get(null) on single-entry unmodifiable Map returns null instead of throwing NPE core-libs / java.util:collections
JDK-8222089 2 [TESTBUG] sun/security/lib/cacerts/VerifyCACerts.java fails due to cert within 90-day expiry window security-libs / java.security
JDK-8222133 3 Add temporary exceptions for root certs that are due to expire soon security-libs / java.security
JDK-8222136 3 Remove two Comodo root CA certificates that are expiring security-libs / java.security
JDK-8222137 3 Remove T-Systems root CA certificate security-libs / java.security
JDK-8222522 4 Add configure options for Mac Bundle creation infrastructure / build
JDK-8222410 4 java/nio/file/attribute/BasicFileAttributeView/UnixSocketFile hangs when "nc" does not accept "-U" core-libs / java.nio
JDK-8222397 4 x86_32 tests with UseSHA1Intrinsics SEGV due to garbled registers hotspot
JDK-8222532 3 (zipfs) Performance regression when writing ZipFileSystem entries in parallel core-libs / java.nio
JDK-8222808 3 Error in jdeps documentation docs / tools
JDK-8222930 3 ConcurrentSkipListMap.clone() shares size variable between original and clone core-libs / java.util.concurrent
JDK-8222913 2 Add Jib support for VERSION_EXTRA* infrastructure
JDK-8223311 3 Update use of "-Djava.security.debug=help" option docs / guides
JDK-8223266 4 PPC64: Check for branch to illegal address before checking for mem serialization hotspot / runtime
JDK-8223395 4 PPC64: Improve comments in the JVM signal handler to match ISA text hotspot / runtime
JDK-8223555 4 Cleanups in cacerts tests security-libs / java.security
JDK-8223499 3 Remove two DocuSign root certificates that are expiring security-libs / java.security
JDK-8223597 3 (zipfs) jdk/nio/zipfs/ZipFSTester.java RuntimeException: CHECK_FAILED! (getAttribute.crc failed 6af4413c vs 0 ...) core-libs / java.nio
JDK-8223665 4 SA: debugd options should follow jhsdb style hotspot / svc-agent
JDK-8224474 2 harfbuzz 2.3.1 code fails to compile with gcc 4.4.7 client-libs / 2d
JDK-8224671 2 AArch64: mauve System.arraycopy test failure hotspot / compiler
JDK-8224727 4 Problem list test security/infra/java/security/cert/CertPathValidator/certification/ActalisCA.java security-libs / java.security
JDK-8224828 4 aarch64: rflags is not correct after safepoint poll hotspot / runtime
JDK-8224880 4 AArch64: java/javac error with AllocatePrefetchDistance hotspot
JDK-8225298 2 Improve TLS connection support
JDK-8225402 4 events logging in deoptimization.cpp should go to deopt-log hotspot / runtime
JDK-8225716 2 G1 GC: Undefined behaviour in G1BlockOffsetTablePart::block_at_or_preceding hotspot / gc
JDK-8226876 3 Assertion in sun/util/locale/provider/CalendarDataUtility on Windows after JDK-8218960 core-libs / java.util:i18n
JDK-8226880 2 Backport of JDK-8208698 (Improved ECC Implementation) should not bring parts of JDK-8205476 (KeyAgreement#generateSecret is not reset for ECDH based algorithm) security-libs / javax.crypto

This section organizes the changes in the selected update release by the main component under which each issue is filed.

Core Libs (42)

Issue
Priority
Title
Component
JDK-8170494 3 JNI exception pending in PlainDatagramSocketImpl.c core-libs / java.net
JDK-8172695 3 (scanner) java/util/Scanner/ScanTest.java fails core-libs / java.util
JDK-8202794 4 Native Unix code should use readdir rather than readdir_r core-libs
JDK-8205432 3 Replace the placeholder Japanese era name core-libs / java.util:i18n
JDK-8206120 3 Add test cases for lenient Japanese era parsing core-libs / java.util:i18n
JDK-8207748 1 Fix for 8202794 breaks tier1 builds core-libs
JDK-8207340 4 (fs) UnixNativeDispatcher close and readdir usages should be fixed core-libs / java.nio
JDK-8206955 4 MethodHandleProxies.asInterfaceInstance does not support default methods core-libs / java.lang.invoke
JDK-8208656 4 Move java/util/Calendar/CalendarTestScripts tests into OpenJDK core-libs / java.util:i18n
JDK-8208634 4 Add x-IBM-1129 charset core-libs / java.nio.charsets
JDK-8210633 4 Cannot parse JapaneseDate string with DateTimeFormatterBuilder Mapped-values core-libs / java.time
JDK-8210899 3 (zipfs) ZipFileSystem.EntryOutputStreamCRC32 mistakenly set the crc32 value into size field core-libs / java.nio
JDK-8211266 3 (zipfs) [TESTBUG] ZipFSTester.java failed intermittently in ZipFSTester.checkRead(): bound must be positive core-libs / java.nio
JDK-8211398 3 Square character support for the Japanese new era core-libs / java.util:i18n
JDK-8211841 4 [testbug] sun/nio/cs/OLD/TestIBMDB.java does not compile (aix) core-libs / java.nio.charsets
JDK-8212794 3 IBM-964 is required for AIX default charset core-libs / java.nio.charsets
JDK-8212828 4 (process) Provide a way for Runtime.exec to use posix_spawn on linux core-libs / java.lang
JDK-8213294 3 Upgrade IANA LSR data core-libs / java.util:i18n
JDK-8213618 3 IBM970 charset has missing entry and remove unexpected entries core-libs / java.nio.charsets
JDK-8214533 3 IBM-29626C is required for AIX default charset core-libs / java.nio.charsets
JDK-8214935 2 Upgrade IANA LSR data core-libs / java.util:i18n
JDK-8215472 4 (zipfs) Cleanups in implementation classes of jdk.zipfs and tests core-libs / java.nio
JDK-8216355 4 missing NULL checks in libnet in interface iteration and potential resource leak in getMacAddress core-libs / java.net
JDK-8217094 3 HttpClient SSL race if a socket IOException is raised before ALPN is available core-libs
JDK-8217311 4 Improve Exception thrown when MulticastSocket.setInterface fails on AIX(Unix) core-libs / java.net
JDK-8217609 3 New era placeholder not recognized by java.text.SimpleDateFormat core-libs / java.util:i18n
JDK-8217880 3 AIX build issue after JDK-8214533 core-libs / java.nio.charsets
JDK-8218781 3 Localized names for Japanese Era Reiwa in COMPAT provider core-libs / java.util:i18n
JDK-8218915 4 Change isJavaIdentifierStart and isJavaIdentifierPart to handle new code points core-libs / java.lang
JDK-8218960 3 CONFIG level logging statements printed in CLDRCalendarDataProviderImpl.java even when default log Level is INFO core-libs / java.util:i18n
JDK-8219890 3 Calendar.getDisplayName() returns empty string for new Japanese Era on some locales core-libs / java.util:i18n
JDK-8220166 4 Performance regression in deserialization (4-6% in SPECjbb) core-libs / java.io:serialization
JDK-8220281 3 IBM-858 alias name is missing on IBM00858 charset core-libs / java.nio.charsets
JDK-8221400 4 java/lang/String/StringRepeat.java test requests too much heap core-libs / java.lang
JDK-8221401 4 java/math/BigInteger/LargeValueExceptions.java test should be disabled on 32-bit platforms core-libs / java.math
JDK-8222027 4 TEST_BUG: java/util/logging/LogManager/TestLoggerNames.java generates intermittent ClassCastException core-libs / java.util.logging
JDK-8221924 3 get(null) on single-entry unmodifiable Map returns null instead of throwing NPE core-libs / java.util:collections
JDK-8222410 4 java/nio/file/attribute/BasicFileAttributeView/UnixSocketFile hangs when "nc" does not accept "-U" core-libs / java.nio
JDK-8222532 3 (zipfs) Performance regression when writing ZipFileSystem entries in parallel core-libs / java.nio
JDK-8222930 3 ConcurrentSkipListMap.clone() shares size variable between original and clone core-libs / java.util.concurrent
JDK-8223597 3 (zipfs) jdk/nio/zipfs/ZipFSTester.java RuntimeException: CHECK_FAILED! (getAttribute.crc failed 6af4413c vs 0 ...) core-libs / java.nio
JDK-8226876 3 Assertion in sun/util/locale/provider/CalendarDataUtility on Windows after JDK-8218960 core-libs / java.util:i18n

Security Libs (32)

Issue
Priority
Title
Component
JDK-6913047 3 Long term memory leak when using PKCS11 and JCE exceeds 32 bit process address space security-libs / javax.crypto:pkcs11
JDK-8179098 3 Crypto AES/ECB encryption/decryption performance regression (introduced in jdk9b73) security-libs / javax.crypto
JDK-8195793 3 Remove GTE CyberTrust Global Root security-libs / java.security
JDK-8201317 4 X25519/X448 code improvements security-libs / javax.crypto
JDK-8201633 3 Problems with AES-GCM native acceleration security-libs / javax.crypto
JDK-8202651 3 Test ComodoCA.java fails security-libs / java.security
JDK-8208648 4 ECC Field Arithmetic Enhancements security-libs / javax.crypto
JDK-8208698 4 Improved ECC Implementation security-libs / javax.crypto
JDK-8211969 3 test/jdk/lib/security/CheckBlacklistedCerts.java searching for wrong paths security-libs / java.security
JDK-8211971 4 Move security/cacerts/VerifyCACerts.java and security/CheckBlacklistedCerts.java security-libs / java.security
JDK-8212562 4 To remove lib/security from test/jdk/TEST.groups security-libs / java.security
JDK-8215443 3 The use of TransportContext.fatal() leads to bad coding style security-libs / javax.net.ssl
JDK-8215790 3 Delegated task created by SSLEngine throws java.nio.BufferUnderflowException security-libs / javax.net.ssl
JDK-8216045 2 The size of key_exchange may be wrong on FFDHE security-libs / javax.net.ssl
JDK-8216597 2 SIGBUS in Java_sun_security_pkcs11_wrapper_PKCS11_getNativeKeyInfo after JDK-6913047 security-libs / javax.crypto:pkcs11
JDK-8216577 2 Add GlobalSign's R6 Root certificate security-libs / java.security
JDK-8217088 2 Disable JDK-6913047 fix (SunPKCS11 memory leak) after JDK-8216597 (SIGBUS error in getNativeKeyInfo) security-libs
JDK-8217690 2 Update public suffix version security-libs / java.security
JDK-8217878 2 ENVELOPING XML signature no longer works security-libs / javax.xml.crypto
JDK-8218618 3 Program fails when using JDK addressed by UNC path and using Security Manager security-libs / java.security
JDK-8218629 3 XML Digital Signature throws NAMESPACE_ERR exception on OpenJDK 11, works 8/9/10 security-libs / javax.xml.crypto
JDK-8219389 3 Delegated task created by SSLEngine throws BufferUnderflowException security-libs / javax.net.ssl
JDK-8220165 2 Encryption using GCM results in RuntimeException: input length out of bound security-libs / javax.crypto
JDK-8220513 4 Wrapper Key may get deleted when closing sessions in SunPKCS11 crypto provider security-libs / javax.crypto:pkcs11
JDK-8222089 2 [TESTBUG] sun/security/lib/cacerts/VerifyCACerts.java fails due to cert within 90-day expiry window security-libs / java.security
JDK-8222133 3 Add temporary exceptions for root certs that are due to expire soon security-libs / java.security
JDK-8222136 3 Remove two Comodo root CA certificates that are expiring security-libs / java.security
JDK-8222137 3 Remove T-Systems root CA certificate security-libs / java.security
JDK-8223555 4 Cleanups in cacerts tests security-libs / java.security
JDK-8223499 3 Remove two DocuSign root certificates that are expiring security-libs / java.security
JDK-8224727 4 Problem list test security/infra/java/security/cert/CertPathValidator/certification/ActalisCA.java security-libs / java.security
JDK-8226880 2 Backport of JDK-8208698 (Improved ECC Implementation) should not bring parts of JDK-8205476 (KeyAgreement#generateSecret is not reset for ECDH based algorithm) security-libs / javax.crypto

Hotspot (100)

Issue
Priority
Title
Component
JDK-8163805 4 hotspot/test/serviceability/sa/sadebugd/SADebugDTest.java failed with timed out hotspot / svc-agent
JDK-8174691 3 [TESTBUG] A number of native hotspot unit tests fail when executed in stand-alone mode hotspot / test
JDK-8181143 4 Introduce diagnostic flag to abort VM on too long VM operations hotspot / runtime
JDK-8188133 3 C2: Static field accesses in clinit can trigger deoptimizations hotspot
JDK-8200613 3 SA: jstack throws UnmappedAddressException with a CDS core file hotspot
JDK-8202414 3 Unsafe write after primitive array creation may result in array length change hotspot
JDK-8202353 4 os::readdir should use readdir instead of readdir_r hotspot / runtime
JDK-8202835 3 jfr/event/os/TestSystemProcess.java fails on missing events hotspot / runtime
JDK-8202884 3 SA: Attach/detach might fail on Linux if debugee application create/destroy threads during attaching hotspot / svc-agent
JDK-8205574 3 Loop predication "assert(f <= 1 && f >= 0) failed Incorrect frequency" hotspot / compiler
JDK-8204308 3 SA: serviceability/sa/TestInstanceKlassSize*.java fails when running in CDS mode hotspot / svc-agent
JDK-8205611 3 Improve the wording of LinkageErrors to include module and class loader information hotspot / runtime
JDK-8209414 3 AArch64: method handle invocation does not respect JVMTI interp_only mode hotspot / svc
JDK-8209415 4 Fix JVMTI test failure HS202 hotspot / jvmti
JDK-8209573 4 [TESTBUG] gc/epsilon/TestMemoryMXBeans should retry on failure hotspot
JDK-8209951 3 Problematic sparc intrinsic: com.sun.crypto.provider.CipherBlockChaining hotspot / compiler
JDK-8210192 4 Hsperf counter ParNew::CMS should be ParNew:CMS hotspot / gc
JDK-8210320 4 PPC64: Fix uninitialized variable in C1 LIR assembler code hotspot / compiler
JDK-8210457 3 JVM crash in ResolvedMethodTable::add_method(Handle) hotspot / runtime
JDK-8210803 3 Compilation failure in codeBlob.cpp for Windows 32-bit hotspot / compiler
JDK-8211100 2 hotspot C1 issue with comparing long numbers on x86 32-bit hotspot / compiler
JDK-8211064 2 [AArch64] Interpreter and c1 don't correctly handle jboolean results in native calls hotspot / runtime
JDK-8211320 3 AArch64: unsafe.compareAndSetByte() and unsafe.compareAndSetShort() c2 intrinsics broken with negative expected value hotspot / compiler
JDK-8211698 2 Crash in C2 compiled code during execution of double array heavy processing code hotspot / compiler
JDK-8212205 2 VM asserts after CDS archive has been unmapped hotspot
JDK-8213015 4 Inconsistent settings between JFR.configure and -XX:FlightRecorderOptions hotspot / jfr
JDK-8213617 3 JFR should record the PID of the recorded process hotspot / jfr
JDK-8213825 2 assert(false) failed: Non-balanced monitor enter/exit! Likely JNI locking hotspot / compiler
JDK-8215284 3 Reduce noise induced by periodic task getFileSize() hotspot / jfr
JDK-8215342 3 [Zero] Build fails after JDK-8200613 hotspot / runtime
JDK-8215374 1 32-bit build failures after JDK-8181143 (Introduce diagnostic flag to abort VM on too long VM operations) hotspot
JDK-8215398 4 -Xlog option usage => Invalid decorator '\temp\app_cds.log'. hotspot
JDK-8215757 2 C2: PhaseIdealLoop::create_new_if_for_predicate() computes wrong IDOM hotspot
JDK-8215707 4 [macosx] fix pthread_getschedparam and pthread_setschedparam calls hotspot / runtime
JDK-8216350 3 AArch64: monitor unlock fast path not called hotspot / compiler
JDK-8215951 2 AArch64: jtreg test vmTestbase/nsk/jvmti/PopFrame/popframe005 segfaults hotspot / jvmti
JDK-8216556 4 Unnecessary liveness computation with JVMTI hotspot / compiler
JDK-8216970 3 condy causes JVM crash hotspot
JDK-8217647 3 JFR: recordings on 32-bit systems unreadable hotspot / jfr
JDK-8217564 3 idempotent protection missing in crc32c.h hotspot / compiler
JDK-8217765 2 Internal Error (javaCalls.cpp:61) guarantee(thread->can_call_java()) failed hotspot
JDK-8217786 3 Provide virtualization related info in the hs_error file on linux s390x hotspot / runtime
JDK-8217879 4 hs_err should print more instructions in hex dump hotspot / runtime
JDK-8218063 1 JDK-8218060 breaks build for S390 hotspot / gc
JDK-8218060 1 JDK-8217786 breaks build due to remaining unused function hotspot / gc
JDK-8218733 4 SA: CollectedHeap provides broken implementation for used() and capacity() hotspot
JDK-8218811 4 replace open by os::open in hotspot coding hotspot / runtime
JDK-8218991 4 s390: Add intrinsic for GHASH algorithm hotspot / compiler
JDK-8219011 4 Implement MacroAssembler::warn method on AArch64 hotspot
JDK-8219112 4 name_and_sig_as_C_string usages in frame_s390 miss ResourceMark hotspot / runtime
JDK-8219335 3 "failed: unexpected type" assert failure in ConnectionGraph::split_unique_types() with unsafe accesses hotspot
JDK-8219006 4 AArch64: Register corruption in slow subtype check hotspot / compiler
JDK-8219460 4 ppc: adjust NativeGeneralJump::insert_unconditional to stack allocated MacroAssembler hotspot / runtime
JDK-8219414 4 SA: jhsdb jsnap throws UnmappedAddressException with core generated by gcore hotspot / svc-agent
JDK-8219448 2 split-if update_uses accesses stale idom data hotspot / compiler
JDK-8219582 3 PPC: Crash after C1 checkcast patched and GC hotspot / compiler
JDK-8219574 4 Minimal VM build failure after JDK-8219414 hotspot / runtime
JDK-8219566 4 JFR did not collect call stacks when MaxJavaStackTraceDepth is set to zero hotspot / jfr
JDK-8219584 4 Try to dump error file by thread which causes safepoint timeout hotspot / runtime
JDK-8219650 3 [TESTBUG] Fix crashes in new test hotspot gtest "test_print_hex_dump" hotspot / runtime
JDK-8219651 4 compiler/ciReplay/TestServerVM.java is failing on windows hotspot / compiler
JDK-8219698 4 aarch64: SIGILL triggered when specifying unsupported hardware features hotspot / runtime
JDK-8219714 4 [testbug] com/sun/jdi/RedefineNestmateAttr/TestNestmateAttr.java must pass classpath to subprocess hotspot / svc
JDK-8219746 3 Provide virtualization related info in the hs_error file on linux ppc64 / ppc64le hotspot / runtime
JDK-8219789 4 [TESTBUG] TestOptionsWithRanges.java produces hs_err_pidXXXXX.log file for VMThreadStackSize=9007199254740991 hotspot / runtime
JDK-8219918 4 ProblemList hotspot tests failing in SAP testing. hotspot / test
JDK-8220198 3 Lots of com/sun/crypto/provider/Cipher tests fail on x86_32 due to missing SHA512 stubs hotspot
JDK-8220293 2 Deadlock in JFR string pool hotspot / jfr
JDK-8220283 4 ZGC fails to build on GCC 4.4.7: ATTRIBUTE_ALIGNED compatibility issue hotspot / runtime
JDK-8220294 4 ZGC fails to build on GCC 4.4.7: Type parameter issue hotspot / gc
JDK-8220353 3 [TESTBUG] TestRegisterRestoring uses SafepointALot without UnlockDiagnosticVMOptions hotspot / test
JDK-8220374 3 C2: LoopStripMining doesn't strip as expected hotspot / compiler
JDK-8220441 3 [PPC64] Clobber memory effect missing for memory barriers in atomics hotspot / runtime
JDK-8220714 3 C2 Compilation failure when accessing off-heap memory using Unsafe hotspot / compiler
JDK-8220707 4 [TESTBUG] serviceability/sa/TestHeapDumpForLargeArray.java fails with jtreg -vmoption:-Xmx < 8g hotspot / svc-agent
JDK-8220718 3 Missing ResourceMark in nmethod::metadata_do hotspot / runtime
JDK-8220781 4 linux-s390 : os::get_summary_cpu_info gives bad output hotspot / runtime
JDK-8221175 4 Fix bad function case for controlled JVM crash on PPC64 big-endian hotspot / runtime
JDK-8221083 2 [ppc64] Wrong oop compare in C1-generated code hotspot / compiler
JDK-8220794 4 PPC64: Fix signal handler for SIGSEGV on branch to illegal address hotspot / runtime
JDK-8221437 3 assert(java_lang_invoke_ResolvedMethodName::vmtarget(resolved_method()) == m()) failed: Should not change after link resolution hotspot / runtime
JDK-8221479 4 [s390] Fix JFR profiling hotspot
JDK-8221470 4 Print methods in exception messages in java-like Syntax. hotspot
JDK-8221483 4 TestOopCmp.java fails due to "Multiple garbage collectors selected" hotspot / compiler
JDK-8221535 3 add steal tick related information to hs_error file [linux] hotspot / runtime
JDK-8221639 4 [i386] expand_exec_shield_cs_limit workaround is undefined code after JDK-8199717 hotspot / runtime
JDK-8221833 4 Readability check in Symbol::is_valid not performed for some addresses hotspot / runtime
JDK-8221915 4 cleanup ticks related coding in os_perf_aix.cpp [aix] hotspot / svc
JDK-8221917 4 serviceability/sa/TestPrintMdo.java fails on 32-bit platforms hotspot
JDK-8221870 4 use driver to run CtwRunner in applications/ctw tests hotspot / compiler
JDK-8222032 3 x86_32 fails with "wrong size of mach node" on AVX-512 machine hotspot / compiler
JDK-8222397 4 x86_32 tests with UseSHA1Intrinsics SEGV due to garbled registers hotspot
JDK-8223266 4 PPC64: Check for branch to illegal address before checking for mem serialization hotspot / runtime
JDK-8223395 4 PPC64: Improve comments in the JVM signal handler to match ISA text hotspot / runtime
JDK-8223665 4 SA: debugd options should follow jhsdb style hotspot / svc-agent
JDK-8224671 2 AArch64: mauve System.arraycopy test failure hotspot / compiler
JDK-8224828 4 aarch64: rflags is not correct after safepoint poll hotspot / runtime
JDK-8224880 4 AArch64: java/javac error with AllocatePrefetchDistance hotspot
JDK-8225402 4 events logging in deoptimization.cpp should go to deopt-log hotspot / runtime
JDK-8225716 2 G1 GC: Undefined behaviour in G1BlockOffsetTablePart::block_at_or_preceding hotspot / gc

Client Libs (48)

Issue
Priority
Title
Component
JDK-8139178 4 Wrong fontMetrics when printing in Landscape (OpenJDK) client-libs / 2d
JDK-8190361 3 Incorrect version info in jaccessinspector.exe and jaccesswalker.exe client-libs
JDK-8203627 2 Swing applications with JRadioButton and JCheckbox fail to render correctly when using GTK3 and the GTK L&F client-libs
JDK-8208996 3 X11 icon window color handing bug client-libs
JDK-8208702 3 javax/swing/reliability/HangDuringStaticInitialization.java may hang on macos client-libs
JDK-8210739 3 Calling JSpinner's setFont with null throws NullPointerException client-libs / javax.swing
JDK-8210782 2 Upgrade HarfBuzz to the latest 2.3.1 client-libs
JDK-8210886 3 Remove references in xwindows.md to non-existent files. client-libs / java.awt
JDK-8210880 3 Remove HPKeysym.h from JDK sources client-libs / java.awt
JDK-8210863 3 Remove Xrandr include files from JDK sources client-libs / java.awt
JDK-8211393 3 Memory leak issue on awt_InputMethod.c client-libs
JDK-8211435 3 Exception in thread "AWT-EventQueue-1" java.lang.IllegalArgumentException: null source client-libs / java.awt
JDK-8211826 3 StringIndexOutOfBoundsException happens via GetStringUTFRegion() client-libs
JDK-8211810 4 X11 Time stamp data should be unsigned client-libs
JDK-8212202 3 [Windows] Exception if no printers are installed. client-libs / 2d
JDK-8212676 3 AWT SystemColor setting on CDE client-libs / java.awt
JDK-8212678 3 Windows IME related patch client-libs / java.awt
JDK-8212677 3 X11 default visual support for IM status window on VNC client-libs
JDK-8213232 3 Unix/X11 setCompositionEnableNative issue client-libs / java.awt
JDK-8213213 4 Remove src/java.desktop/unix/classes/sun/awt/X11/keysym2ucs.h client-libs / java.awt
JDK-8213292 2 Input freezes after MacOS key-selector (press&hold) usage on macOS Mojave client-libs / java.awt
JDK-8213614 3 DnD operation change feature does not work with 64bit big endian CPU client-libs
JDK-8213944 2 Fix AIX build after the removal of Xrandr.h and add a configure check for it client-libs / java.awt
JDK-8214109 3 XToolkit is not correctly displayed color on 16-bit high color setting client-libs
JDK-8214002 3 Cannot use italic font style if the font has embedded bitmap client-libs
JDK-8214111 3 There is no icon in all JOptionPane target image client-libs
JDK-8214112 3 The whole text in target JPasswordField image are not selected. client-libs / javax.swing
JDK-8214252 3 Expanded & Collapsed nodes of a JTree look the same on GTK3 client-libs
JDK-8214253 3 Tooltip is transparent rather than having a black background client-libs / javax.swing
JDK-8214765 3 All TrayIcon MessageType icons does not show up with gtk3 option set client-libs
JDK-8215364 3 JavaFX crashes on Ubuntu 18.04 with Wayland while using Swing-FX interop client-libs
JDK-8217263 3 Automate DashOffset test client-libs
JDK-8217707 3 JNICALL declaration breaks Splash screen functions client-libs / 2d
JDK-8218020 2 Fix version number in mesa.md 3rd party legal file client-libs
JDK-8218469 2 JSlider display issue with slider for GTKLookAndFeel client-libs
JDK-8218470 2 JScrollBar display issue with GTKLookAndFeel client-libs
JDK-8218472 2 JProgressBar display issue with GTKLookAndFeel client-libs
JDK-8218479 2 JTextPane display issue with GTKLookAndFeel client-libs
JDK-8218473 2 JOptionPane display issue with GTKLookAndFeel client-libs
JDK-8218674 3 HTML Tooltip with "img src=" on component doesn't show client-libs / javax.swing
JDK-8218854 4 FontMetrics.getMaxAdvance may be less than the maximum FontMetrics.charWidth client-libs / 2d
JDK-8220349 3 The fix done for JDK-8214253 have caused issues in JTree behaviour client-libs / javax.swing
JDK-8220495 2 Update GIFlib library to the 5.1.8 client-libs / java.awt
JDK-8221304 3 Problem list java/awt/FontMetrics/MaxAdvanceIsMax.java client-libs / 2d
JDK-8221244 3 Unexpected behavior of PropertyDescription.getReadMethod for boolean properties client-libs / java.beans
JDK-8221263 3 [TEST_BUG] RemotePrinterStatusRefresh test is hard to use client-libs / 2d
JDK-8221412 3 lookupPrintServices() does not always update the list of Windows remote printers client-libs / 2d
JDK-8224474 2 harfbuzz 2.3.1 code fails to compile with gcc 4.4.7 client-libs / 2d

Other (30)

Issue
Priority
Title
Component
JDK-8200286 3 (testbug) MOptionTest test fails with java.lang.AssertionError: Classfiles too old! tools / javac
JDK-8207760 4 SAXException: Invalid UTF-16 surrogate detected: d83c ? xml / javax.xml.transform
JDK-8209055 3 c.s.t.javac.code.DeferredCompletionFailureHandler seems to use WeakHashMap incorrectly tools / javac
JDK-8210008 4 custom extension for make/SourceRevision.gmk infrastructure / build
JDK-8209914 3 javadoc search sometimes generates bad URIs tools / javadoc(tool)
JDK-8210283 3 Support git as an SCM alternative in the build infrastructure / build
JDK-8210197 3 javac can't tell during speculative attribution if a diamond expression is creating an anonymous inner class or not tools / javac
JDK-8210483 2 AssertionError in DeferredAttr at setOverloadKind caused by JDK-8203679 tools / javac
JDK-8210519 2 build/releaseFile/CheckSource.java failed additional sources found infrastructure / build
JDK-8210837 3 Add libXrandr-devel to the Linux devkits infrastructure / build
JDK-8211350 4 Remove jprt support infrastructure / build
JDK-8213515 4 Improve freetype detection on linux/ppc64/ppc64le/s390x infrastructure / build
JDK-8214122 3 JDWP is broken on 32 bit Windows: transport library missing onLoad entry core-svc / debugger
JDK-8214468 3 jQuery UI upgrade from 1.11.4 to 1.12.1 tools
JDK-8215123 3 Crash in runtime image built with jlink --compress=2 tools / jlink
JDK-8215026 3 Incorrect amount of memory unmapped with ImageFileReader::close() tools / jlink
JDK-8215296 3 do not disable c99 on Solaris infrastructure / build
JDK-8218152 3 [javac] fails and exits with no error if a bad annotation processor provided tools / javac
JDK-8219710 4 Bump update version for OpenJDK: jdk11.0.5 infrastructure / release_eng
JDK-8219915 4 [TESTBUG] Fix test langtools/tools/javac/processing/model/completionfailure/SymbolsDontCumulate.java in standalone mode tools / javac
JDK-8220625 3 tools/javac/classreader/8171132/BadConstantValue.java failed with "did not see expected error" tools / javac
JDK-8221318 4 [11u] do not disable c99 on Solaris infrastructure / build
JDK-8221610 4 Resurrect (legacy) JRE bundle target infrastructure / build
JDK-8221769 4 Revert JDK-8221767 mistakenly pushed to jdk11u 11.0.3 xml / javax.xml.transform
JDK-8221880 4 Better customization for Windows RC properties FileDescription and ProductName infrastructure / build
JDK-8222522 4 Add configure options for Mac Bundle creation infrastructure / build
JDK-8222808 3 Error in jdeps documentation docs / tools
JDK-8222913 2 Add Jib support for VERSION_EXTRA* infrastructure
JDK-8223311 3 Update use of "-Djava.security.debug=help" option docs / guides
JDK-8225298 2 Improve TLS connection support