This section lists and comments on the highlights of the changes in the selected update release.

Issue
Priority
Title
Component
Foojay Commentary
Category
Voting
JDK-8223490 3 Optimize search algorithm for determining default time zone core-libs / java.util

Optimizes the search path for java.util.TimeZone.getDefault so that the most common time zones are queried first.

performance 10
JDK-8229022 4 BufferedReader performance can be improved by using StringBuilder core-libs / java.io

Substantial performance improvement in BufferedReader by using StringBuilder instead of StringBuffer, giving a ~13% performance boost.

performance 10
JDK-8232879 2 (zipfs) Writing out data with ZipFileSystem leads to a CRC failure in the generated jar file core-libs / java.nio

Fixes a problem discovered by the Quarkus community for JAR files to be produced with correct CRC32 entries.

fix 10

This section lists all the changes in the selected update release.

Issue
Priority
Title
Component
Voting
JDK-8016914 3 CoreDocumentImpl.setXmlVersion NPE xml / javax.xml.parsers 0
JDK-8048556 3 Unnecessary GCLocker-initiated young GCs hotspot / gc 0
JDK-8080462 3 Update SunPKCS11 provider with PKCS11 v2.40 support security-libs / javax.crypto:pkcs11 0
JDK-8134672 4 [TEST_BUG] Some tests should check isDisplayChangeSupported client-libs 0
JDK-8146238 3 [macosx] Java2D Queue Flusher crash on OSX after switching between user accounts client-libs / 2d 0
JDK-8144125 4 [macos] java/awt/event/ComponentEvent/MovedResizedTwiceTest/MovedResizedTwiceTest.java failed automatically client-libs / java.awt 0
JDK-8176837 4 SunPKCS11 provider needs to check more details on PKCS11 Mechanism security-libs / javax.crypto:pkcs11 0
JDK-8185898 3 setRequestProperty(key, null) results in HTTP header without colon in request core-libs / java.net 0
JDK-8190737 3 use unicode version of the canonicalize() function to handle long path on windows hotspot / runtime 0
JDK-8193325 3 StackFrameInfo::getByteCodeIndex returns wrong value if bci > 32767 core-libs / java.lang 0
JDK-8193255 4 Root Certificates should be stored in text format and assembled at build time infrastructure / build 0
JDK-8191521 3 handle long relative path specified in -Xbootclasspath/a on windows hotspot / runtime 0
JDK-8198882 4 Add 10 JNDI tests to com/sun/jndi/dns/AttributeTests/ core-libs / javax.naming 0
JDK-8202359 3 [GRAAL] compiler/uncommontrap/TestDeoptOOM.java failed with OutOfMemoryError hotspot / compiler 0
JDK-8200381 5 Typos in javadoc - missing verb "be" and alike core-libs 0
JDK-8205516 2 JFR tool hotspot / jfr 0
JDK-8204203 2 Many pkcs11 tests failed in Provider initialization, after compiler on Windows changed security-libs / javax.crypto:pkcs11 0
JDK-8207922 4 ctw of jdk.security.auth failed with "Unexpected zero exit codebefore finishing all compilations" hotspot / compiler 0
JDK-8207263 3 Store the Configuration for system modules into CDS archive hotspot / runtime 0
JDK-8206115 3 Use shared macros for JavaClasses::compute_offsets and MetaspaceShared::serialize_well_known_classes hotspot / runtime 0
JDK-8208582 4 Introduce native oop barriers in C1 for OopHandle hotspot / compiler 0
JDK-8208364 3 java/lang/reflect/callerCache/ReflectionCallerCacheTest.java missing module dependencies declaration core-libs / java.lang:reflect 0
JDK-8208236 3 [TESTBUG] vmTestbase/nsk/stress/stack tests fail by timeout hotspot / compiler 0
JDK-8208179 3 Devanagari not shown with logical fonts on Windows after removal of Lucida Sans from JDK client-libs / 2d 0
JDK-8209003 4 Consolidate use of empty collections in java.lang.module core-libs / java.lang.module 0
JDK-8208601 4 Introduce native oop barriers in C2 for OopHandle hotspot / compiler 0
JDK-8209647 3 constantPoolHandle::constantPoolHandle(ConstantPool*) when precompiled header is disabled hotspot / runtime 0
JDK-8209545 3 Simplify HeapShared::archive_module_graph_objects hotspot / runtime 0
JDK-8209178 4 Proxied HttpsURLConnection doesn't send BODY when retrying POST request core-libs / java.net 0
JDK-8209120 4 Archive the Integer.IntegerCache hotspot / runtime 0
JDK-8209790 3 SA tools not providing option to connect to debug server hotspot / svc-agent 0
JDK-8209771 4 jdk.test.lib.Utils::runAndCheckException error other-libs / other 0
JDK-8209691 4 Allow MemBar on single memory slice hotspot / compiler 0
JDK-8210158 4 Accessorize JFR getEventWriter() intrinsics hotspot 0
JDK-8209972 3 [GRAAL] Don't run RTM tests with Graal hotspot / compiler 0
JDK-8209835 4 Aarch64: elide barriers on all volatile operations hotspot 0
JDK-8209833 3 C2 compilation fails with "assert(ex_map->jvms()->same_calls_as(_exceptions->jvms())) failed: all collected exceptions must come from the same place" hotspot / compiler 0
JDK-8210559 3 ClassLoaderData Symbols can leak hotspot 0
JDK-8210403 4 Refactor java.util.Locale:i18n shell tests to plain java tests core-libs / java.util:i18n 0
JDK-8210387 3 C2 compilation fails with "assert(node->_last_del == _last) failed: must have deleted the edge just produced" hotspot / compiler 0
JDK-8210384 3 SunLayoutEngine.isAAT() font is expensive on MacOS client-libs / 2d 0
JDK-8211037 4 Load jib jars dynamically from JibArtifactResolver infrastructure 0
JDK-8210789 4 langtools/tools/javac/T8152616.java missing @modules tools / javac 0
JDK-8210776 2 Upgrade X Window System 6.8.2 to the latest XWD 1.0.7 client-libs 0
JDK-8211866 3 TLS 1.3 CertificateRequest message sometimes offers disallowed signature algorithms security-libs / javax.net.ssl 0
JDK-8211740 3 [AOT] -XX:AOTLibrary doesn't accept windows path hotspot / compiler 0
JDK-8211385 3 (zipfs) ZipDirectoryStream yields a stream of absolute paths when directory is relative core-libs / java.nio 0
JDK-8211147 4 Incorrect comparator com.sun.beans.introspect.MethodInfo.MethodOrder client-libs / java.beans 0
JDK-8212028 2 Use run-test makefile framework for testing in Oracle's Mach5 infrastructure / build 0
JDK-8211992 3 GraphicsConfiguration.getDevice().getDisplayMode() causes JVM crash on Mac client-libs / java.awt 0
JDK-8211919 3 (zipfs) ZipDirectoryStream should provide a stream of paths that are relative to the directory core-libs / java.nio 0
JDK-8212673 3 jtreg/applications/runthese/RunThese30M.java fails in C2 with "assert(!had_error) failed: bad dominance" hotspot / compiler 0
JDK-8212627 3 [TESTBUG] runtime/CreateMirror/ArraysNewInstanceBug.java timed out hotspot / runtime 0
JDK-8212071 3 Need to set the FreeType LCD Filter to reduce fringing. client-libs / 2d 0
JDK-8212970 2 TZ database in "vanguard" format support core-libs / java.time 0
JDK-8212752 4 Typo in SSL log message related to inactive/disabled signature scheme security-libs / javax.net.ssl 0
JDK-8212738 3 Incorrectly named signature scheme ecdsa_secp512r1_sha512 security-libs / javax.net.ssl 0
JDK-8213014 4 Crash in CompileBroker::make_thread due to OOM hotspot 0
JDK-8213008 3 Cipher with UNWRAP_MODE should support the generation of an AES key type security-libs / javax.crypto:pkcs11 0
JDK-8213005 2 Missing symbols in hs_err files on Windows after JDK-8212028 infrastructure 0
JDK-8213448 3 [TESTBUG] enhance jfr/jvm/TestDumpOnCrash hotspot / jfr 0
JDK-8213406 3 (fs) More than one instance of built-in FileSystem observed in heap core-libs 0
JDK-8213381 4 Hook to allow GC to inject Node::Ideal() calls hotspot / compiler 0
JDK-8213119 2 [macos] java/awt/GraphicsDevice/CheckDisplayModes.java fails client-libs / java.awt 0
JDK-8214046 2 [macosx] Undecorated Frame does not Iconify when set to client-libs / java.awt 0
JDK-8213604 2 Fix missing includes after JDK-8212673 hotspot / compiler 0
JDK-8213568 4 Typo in java/awt/GraphicsEnvironment/LoadLock/GE_init5.java client-libs / 2d 0
JDK-8214315 2 G1: fatal error: acquiring lock SATB_Q_FL_lock/1 out of order with lock tty_lock/0 hotspot 0
JDK-8214311 4 dtrace gensrc has missing dependencies infrastructure / build 0
JDK-8214098 2 sun.security.ssl.HandshakeHash.T12HandshakeHash constructor check backwards. security-libs / javax.net.ssl 0
JDK-8214052 4 [testbug] vmTestbase/vm/compiler/CodeCacheInfoOnCompilation - wrong shell used hotspot / compiler 0
JDK-8214750 3 Unnecessary

tags in jfr classes

hotspot / jfr 0
JDK-8214542 3 JFR: Old Object Sample event slow on a deep heap in debug builds hotspot / jfr 0
JDK-8214321 4 Misleading code in SSLCipher security-libs / javax.net.ssl 0
JDK-8214925 3 [TESTBUG] JFR tool fails to execute hotspot / jfr 0
JDK-8214896 1 JFR Tool left files behind hotspot / jfr 0
JDK-8214773 4 Replace use of thread unsafe strtok hotspot / compiler 0
JDK-8215200 3 IllegalArgumentException in sun.lwawt.macosx.CPlatformWindow client-libs / java.awt 0
JDK-8215105 3 java/awt/Robot/HiDPIScreenCapture/ScreenCaptureTest.java: Wrong Pixel Color client-libs 0
JDK-8215032 4 Support Kerberos cross-realm referrals (RFC 6806) security-libs / org.ietf.jgss:krb5 0
JDK-8214975 3 No hs-err file if fatal error is raised during dynamic initialization. hotspot 0
JDK-8215524 3 Finished message validation failure should be decrypt_error alert security-libs / javax.net.ssl 0
JDK-8215449 4 Several tests failing when jtreg run with -vmoption:--illegal-access=deny core-libs 0
JDK-8215411 3 some GetByteArrayElements calls miss corresponding Release other-libs 0
JDK-8215771 3 The jfr tool should pretty print reference chains hotspot / jfr 0
JDK-8215755 2 ZGC: split_barrier_thru_phi: check number of inputs of phi hotspot / compiler 0
JDK-8215708 2 ZGC: Add missing LoadBarrierNode::size_of() hotspot / compiler 0
JDK-8215699 3 -Xlog::file cannot be used with named pipe hotspot 0
JDK-8216135 2 C2 assert(!had_error) failed: bad dominance hotspot / compiler 0
JDK-8216064 3 -XX:StartFlightRecording:settings= doesn't work properly hotspot / jfr 0
JDK-8215913 4 [Test_bug]java/util/Locale/LocaleProvidersRun.java failed on de_DE and ja_JP locale. core-libs 0
JDK-8216426 4 Usage of array placement new may lead to memory corruption hotspot / runtime 0
JDK-8216363 4 NullPointerException in java.util.logging.Handler#isLoggable core-libs / java.util.logging 0
JDK-8216283 3 Allow shorter method sampling interval than 10 ms hotspot / jfr 0
JDK-8216977 4 ShowHiddenFrames use in java_lang_StackTraceElement::fill_in appears broken hotspot / runtime 0
JDK-8216561 4 HttpClient: The logic of retry on connect exception is inverted core-libs / java.net 0
JDK-8217610 3 TLSv1.3 fail with ClassException when EC keys are stored in PKCS11 security-libs / javax.net.ssl 0
JDK-8217362 4 Emergency dump does not work when disk=false is set hotspot / jfr 0
JDK-8218468 3 Load barrier slow path node should be MachTypeNode hotspot / compiler 0
JDK-8217731 3 Font rendering and glyph spacing changed from jdk-8 to jdk-11 client-libs / 2d 0
JDK-8219013 3 Update Apache Santuario (XML Signature) to version 2.1.3 security-libs / javax.xml.crypto 0
JDK-8218935 4 Make jfr strncpy uses GCC 8.x friendly hotspot / jfr 0
JDK-8218580 3 endpoint identification algorithm should be case-insensitive security-libs / javax.net.ssl 0
JDK-8219504 4 Test for JDK-8211435 can be run on all platforms client-libs 0
JDK-8220231 4 Cache HarfBuzz face object for same font's text layout calls client-libs / 2d 0
JDK-8220175 3 serviceability/dcmd/framework/VMVersionTest.java fails with a timeout core-svc 0
JDK-8219914 3 Change the environment variable for Java Access Bridge logging to have a directory client-libs / javax.accessibility 0
JDK-8220476 4 Incorrect GPL header in src/jdk.internal.jvmstat/share/classes/sun/jvmstat/perfdata/monitor/protocol/local/PerfDataFile.java core-svc 0
JDK-8220474 4 Incorrect GPL header in src/java.instrument/share/classes/java/lang/instrument/package-info.java core-svc / java.lang.instrument 0
JDK-8220394 3 bufferedStream does not honor size limit hotspot 0
JDK-8220352 3 [TESTBUG] Crash with assert(external_guard || result != __null) failed: Invalid JNI handle hotspot / jvmti 0
JDK-8220598 4 Malformed copyright year range in a few files in java.base core-libs 0
JDK-8220555 4 JFR tool shows potentially misleading message when it cannot access a file hotspot / jfr 0
JDK-8220528 3 [AIX] Fix basic Xinerama and Xrender functionality client-libs 0
JDK-8221246 3 NullPointerException within Win32ShellFolder2 client-libs / java.awt 0
JDK-8221172 4 SunEC specific test is not limited to SunEC security-libs / javax.crypto 0
JDK-8221092 3 UseAVX=3 has performance degredation on Skylake (X7) processors hotspot / compiler 0
JDK-8221407 4 Windows 32bit build error in libsunmscapi/security.cpp security-libs / javax.crypto 0
JDK-8221406 4 Windows 32bit build error in NetworkInterface_winXP.c core-libs / java.net 0
JDK-8221395 3 HttpClient leaving connections in CLOSE_WAIT state until Java process ends core-libs / java.net 0
JDK-8221539 4 [metaspace] Improve MetaspaceObj::is_metaspace_obj() and friends hotspot / runtime 0
JDK-8221532 4 Incorrect copyright header in FileSystemSupport_md.c hotspot / svc 0
JDK-8221456 4 nmethod::make_unloaded() clears _method member too early hotspot 0
JDK-8221711 3 [TESTBUG] create more tests for JFR in container environment hotspot / jfr 0
JDK-8221569 3 JFR tool produces incorrect output when both --categories and --events are specified hotspot / jfr 0
JDK-8222015 4 Small VM.metaspace improvements hotspot / runtime 0
JDK-8221913 4 Add GC.selected() jtreg-ext function hotspot / gc 0
JDK-8222529 4 sun.jdwp.listenerAddress agent property uses wrong encoding core-svc 0
JDK-8222440 3 (zipfs) JarFileSystem does not correctly handle versioned entries if no root entry is present core-libs / java.nio 0
JDK-8222154 4 upgrade gtest to 1.8.1 hotspot 0
JDK-8223438 4 add VirtualizationInformation JFR event hotspot 0
JDK-8222888 4 [TESTBUG] docker/TestJFREvents.java fails due to "RuntimeException: JAVA_MAIN_CLASS_* is not defined" hotspot / runtime 0
JDK-8222807 3 (zipfs) OutOfMemory on compiling with darcula.jar in classpath core-libs / java.nio 0
JDK-8223697 3 jfr tool can't format duration values greater than 1 minute hotspot / jfr 0
JDK-8223490 3 Optimize search algorithm for determining default time zone core-libs / java.util 10
JDK-8224157 4 BCEL: update to version 6.3.1 xml / jaxp 0
JDK-8224152 4 [macOS] ProblemList tests that leave rubbish on the screen client-libs / java.awt 0
JDK-8223869 4 Problem list java/awt/FontMetrics/MaxAdvanceIsMax.java on more platforms client-libs / 2d 0
JDK-8224502 4 [TESTBUG] JDK docker test TestSystemMetrics.java fails with access issues and OOM core-libs 0
JDK-8224217 3 RecordingInfo should use textual representation of path hotspot / jfr 0
JDK-8224193 3 stringStream should not use Resource Area hotspot / runtime 0
JDK-8224538 3 LoadBarrierNode::common_barrier must check address hotspot / compiler 0
JDK-8224505 3 TestQuotedLogOutput failure after ProcessBuilder changes core-libs / java.lang 0
JDK-8224589 4 Improve startup behavior of SecurityProperties security-libs 0
JDK-8224909
/ CVE-2020-2583
2 Unlink Set of LinkedHashSets Serialization 0
JDK-8225004 3 Remove invalid assertion in jfr_conditional_flush() hotspot / jfr 0
JDK-8224958 4 add os::dll_load calls to event log hotspot / runtime 0
JDK-8225225 4 stringStream internal buffer should always be zero terminated hotspot 0
JDK-8225101 3 Crash at sun.awt.X11.XlibWrapper.XkbGetUpdatedMap when change keybord map client-libs / java.awt 0
JDK-8225279 2 Better XRender interpolation 0
JDK-8225261 2 Better method resolutions 0
JDK-8225390 4 ProblemList sun/security/pkcs11/sslecc/ClientJSSEServerJSSE.java due to JDK-8161536 security-libs / javax.crypto:pkcs11 0
JDK-8225425 2 java.lang.UnsatisfiedLinkError: net.dll: Can't find dependent libraries core-libs / java.net 0
JDK-8225392 3 Comparison builds are failing due to cacerts file infrastructure / build 0
JDK-8225505 3 ctrl-F1 does not show the tooltip of a menu item (JMenuItems) client-libs / javax.swing 0
JDK-8225695 1 32-bit build failures after JDK-8080462 (Update SunPKCS11 provider with PKCS11 v2.40 support) security-libs / javax.crypto:pkcs11 0
JDK-8225694 3 Destination option missing in FlightRecorderMXBeanImpl hotspot / jfr 0
JDK-8225745 3 NoSuchAlgorithmException exception for SHA256withECDSA with RSASSA-PSS support security-libs / java.security 0
JDK-8226352
/ CVE-2020-2590
2 Improve Kerberos interop capabilities Security 0
JDK-8226513 3 JEditorPane is shown with incorrect size client-libs 0
JDK-8226651 3 Setting the mgfHash in CK_RSA_PKCS_PSS_PARAMS has no effect security-libs / javax.crypto:pkcs11 0
JDK-8226719 2 Kerberos login to Windows 2000 failed with "Inappropriate type of checksum in message" security-libs / org.ietf.jgss 0
JDK-8226779 3 [TESTBUG] Test JFR API from Java agent hotspot / jfr 0
JDK-8226899 3 Problemlist compiler/rtm tests hotspot / compiler 0
JDK-8226869 3 Test java/util/Locale/LocaleProvidersRun.java should enable assertions core-libs / java.util:i18n 0
JDK-8227035 4 JVM::printFlags fails in native OOM situations hotspot 0
JDK-8227032 4 MetaspaceUtils::print_report crashes when called before initialization hotspot 0
JDK-8227031 4 Print NMT statistics on fatal errors hotspot / runtime 0
JDK-8227086 4 Use AS_NO_KEEPALIVE loads in HeapDumper hotspot 0
JDK-8227061 3 KDC.java test behaves incorrectly when AS-REQ contains a PAData not PA-ENC-TS-ENC security-libs / org.ietf.jgss:krb5 0
JDK-8227127 2 Era designator not displayed correctly using the COMPAT provider core-libs / java.text 0
JDK-8227381 3 GSS login fails with PREAUTH_FAILED security-libs / org.ietf.jgss 0
JDK-8227368 3 EnumSet.class serialization broken in JDK 9+ core-libs / java.util:collections 0
JDK-8227338 4 templateInterpreter.cpp: copy_table() needs to be safer hotspot 0
JDK-8227397 4 Add --with-extra-asflags configure option infrastructure / build 0
JDK-8227391 3 Update double-conversion to version 3.1.5 core-libs / jdk.nashorn 0
JDK-8227435 4 Perf::attach() should not throw a java.lang.Exception core-svc 0
JDK-8227411 3 TestTimeMultiple.java failed "assert(!lease()) failed: invariant" hotspot / jfr 0
JDK-8227473 2 Improve gstreamer media support javafx / media 0
JDK-8227439 3 Turn off AOT by default hotspot / compiler 0
JDK-8227437 2 S4U2proxy cannot continue because server's TGT cannot be found security-libs / org.ietf.jgss:krb5 0
JDK-8227642 4 [TESTBUG] Make docker tests podman compatible hotspot 0
JDK-8227605 2 Kitchensink fails "assert((((klass)->trace_id() & (JfrTraceIdEpoch::leakp_in_use_this_epoch_bit())) != 0)) failed: invariant" hotspot / jfr 0
JDK-8227758 2 More valid PKIX processing 0
JDK-8227816 2 More Colorful ICC profiles 0
JDK-8228337 3 problemList failing/ignored manual tests in security-libs security-libs 0
JDK-8228368 4 avoid incompatible pointer to integer conversion initializing gint in gtk2_interface client-libs 0
JDK-8228434 3 jdk/net/Sockets/Test.java fails after JDK-8227642 core-libs / java.net 0
JDK-8228465 3 HOST locale provider holds wrong era name for GregorianCalendar in US locale core-libs / java.util:i18n 0
JDK-8228469 4 (tz) Upgrade time-zone data to tzdata2019b core-libs / java.time 0
JDK-8228548
/ CVE-2020-2593
2 Normalize normalization for all Networking 0
JDK-8228625 4 [TESTBUG] sun/tools/jhsdb/JShellHeapDumpTest.java fails with RuntimeException 'JShellToolProvider' missing from stdout/stderr hotspot / svc-agent 0
JDK-8228645 4 Don't run sun/security/pkcs11/Cipher/TestKATForGCM.java on buggy NSS solaris versions security-libs / javax.crypto:pkcs11 0
JDK-8228687 4 [TESTBUG] exclude Container tests from hotspot_misc group hotspot 0
JDK-8228772 3 C2 compilation fails due to unschedulable graph if DominatorSearchLimit is reached hotspot / compiler 0
JDK-8228834 2 Regression caused by JDK-8214542 not installing complete checkpoint data to candidates hotspot / jfr 0
JDK-8228835 3 Memory leak in PKCS11 provider when using AES GCM security-libs / javax.crypto:pkcs11 0
JDK-8228888 3 C2 compilation fails with assert "m has strange control" hotspot / compiler 0
JDK-8228902 3 add os::dll_load to the unified logging os category hotspot / runtime 0
JDK-8229016 2 C2 scalarization crashes with assert(node->Opcode() == Op_CastP2X) failed: ConvP2XNode required hotspot / compiler 0
JDK-8229020 4 Failure on CPUs allowing loads reordering: assert(_tasks[t] == 1) failed: What else? hotspot / gc 0
JDK-8229022 4 BufferedReader performance can be improved by using StringBuilder core-libs / java.io 10
JDK-8229156 4 ProblemList gc/stress/gclocker/TestExcessGCLockerCollections.java hotspot / gc 0
JDK-8229169 4 False failure of GenericTaskQueue::pop_local on architectures with weak memory model hotspot / gc 0
JDK-8229182 3 [TESTBUG] runtime/containers/docker/TestMemoryAwareness.java test fails on SLES12 hotspot 0
JDK-8229243 3 SunPKCS11-Solaris provider tests failing on Solaris 11.4 security-libs / javax.crypto:pkcs11 0
JDK-8229284 4 [TESTBUG] jdk/internal/platform/cgroup/TestCgroupMetrics.java fails for - memory:getMemoryUsage hotspot / runtime 0
JDK-8229408 4 Bump update version for OpenJDK: jdk-11.0.6 infrastructure 0
JDK-8229420 3 [Redo] jstat reports incorrect values for OU for CMS GC hotspot / gc 0
JDK-8229437 2 assert(is_aligned(ref, HeapWordSize)) failed: invariant hotspot / jfr 0
JDK-8229450 2 C2 compilation fails with assert(found_sfpt) failed: no node in loop that's not input to safepoint hotspot / compiler 0
JDK-8229483 3 Sinking load out of loop may trigger: assert(found_sfpt) failed: no node in loop that's not input to safepoint hotspot / compiler 0
JDK-8229496 2 SIGFPE (division by zero) in C2 OSR compiled method hotspot / compiler 0
JDK-8229515 4 [macos] access to window property of NSView on wrong thread client-libs / java.awt 0
JDK-8229701 2 aarch64: C2 OSR compilation fails with "shouldn't process one node several times" in final graph reshaping hotspot / compiler 0
JDK-8229728 2 Implement negotiation parameters 0
JDK-8229773 3 Resolve permissions for code source URLs lazily security-libs 0
JDK-8229810 3 [macos] NullPointerException getting bounds of GraphicsConfiguration client-libs / java.awt 0
JDK-8229800 2 WindowsServerCore 1809 does not provide d2d1.dll library required by awt.dll client-libs / 2d 0
JDK-8229872 4 (fs) Increase buffer size used with getmntent core-libs / java.nio 0
JDK-8229899 4 java.io.File.isInvalid() is racy core-libs / java.io 0
JDK-8229887 2 (zipfs) zip file corruption when replacing an existing STORED entry core-libs / java.nio 0
JDK-8229951
/ CVE-2020-2601
2 Better Ticket Granting Services Security 0
JDK-8230061 2 # assert(mode == ControlAroundStripMined && use == sfpt) failed: missed a node hotspot / compiler 0
JDK-8230062 2 assert(i == p->size()-1) failed: must be last element of the pack hotspot / compiler 0
JDK-8230085 2 (fs) FileStore::isReadOnly is always true on macOS Catalina core-libs / java.nio 0
JDK-8230110 4 TestLinkageErrorInGenerateOopMap times out hotspot 0
JDK-8230115 4 Problemlist JFR TestNetworkUtilization test hotspot / jfr 0
JDK-8230238 4 Add another regression test for JDK-8134739 hotspot / compiler 0
JDK-8230279 2 Improve Pack200 file reading 0
JDK-8230303 3 JDB hangs when running monitor command core-svc / debugger 0
JDK-8230318 2 Better trust store usage 0
JDK-8230363 3 C2: Let ConnectionGraph::not_global_escape(Node* n) return false if n is not in the CG hotspot / compiler 0
JDK-8230376 4 [TESTBUG] runtime/StackTrace/HiddenFrameTest.java fails with release VM hotspot / runtime 0
JDK-8230388 4 Problemlist additional compiler/rtm tests hotspot / compiler 0
JDK-8230466 4 check malloc/calloc results in jdk.hotspot.agent hotspot 0
JDK-8230646 3 Epsilon does not extend TLABs to max size hotspot 0
JDK-8230669 3 [s390] C1: assert(is_bound() || is_unused()) failed: Label was never bound to a location, but it was used as a jmp target hotspot / compiler 0
JDK-8230671 1 x86_32 build failures after JDK-8229496 hotspot / compiler 0
JDK-8230711 3 ConnectionGraph::unique_java_object(Node* N) return NULL if n is not in the CG hotspot / compiler 0
JDK-8230728 3 Thin stroked shapes are not rendered if affine transform has flip bit client-libs 0
JDK-8230769 3 BufImg_SetupICM add ReleasePrimitiveArrayCritical call in early return client-libs / 2d 0
JDK-8230782 3 Robot.createScreenCapture() fails if “awt.robot.gtk” is set to false client-libs / java.awt 0
JDK-8230813 4 Add JDK-8010500 to compiler/loopopts/superword/TestFuzzPreLoop.java bug list hotspot / compiler 0
JDK-8230850 3 Test sun/tools/jcmd/TestProcessHelper.java fails intermittently hotspot 0
JDK-8230861 4 missing ReleaseStringUTFChars in Java_sun_security_pkcs11_wrapper_PKCS11_connect security-libs / java.security 0
JDK-8230856 4 Java_java_net_NetworkInterface_getByName0 on unix misses ReleaseStringUTFChars in early return core-libs / java.net 0
JDK-8230873 3 [AIX] GUI app does not work with UTF-8 locale on minimum software requirements client-libs / java.awt 0
JDK-8230881 3 serviceability/sa/TestJmapCore tests fail with java.lang.RuntimeException: Could not find dump file hotspot / svc-agent 0
JDK-8230900 4 missing ReleaseStringUTFChars in java.desktop native code client-libs 0
JDK-8230901 4 missing ReleaseStringUTFChars in serviceability native code core-svc 0
JDK-8230923 3 SunJSSE is not properly initialized in FIPS mode from a configuration file security-libs 0
JDK-8230943 4 False deadlock detection with -XX:+CIPrintCompileQueue after JDK-8163511 hotspot / compiler 0
JDK-8230967 2 Improve Registry support of clients 0
JDK-8231055 2 C2: arraycopy with same non escaping src and dest but different positions causes wrong execution hotspot / compiler 0
JDK-8231098 3 (tz) Upgrade time-zone data to tzdata2019c core-libs / java.time 0
JDK-8231085 4 C2/GC: Better GC-interface for expanding clone hotspot / compiler 0
JDK-8231124 4 Missing closedir call with JDK-8223490 core-libs / java.util 0
JDK-8231129 2 More glyph images 0
JDK-8231139 2 Improved keystore support 0
JDK-8231201 4 hs_err should print coalesced safepoint operations in Events section hotspot / runtime 0
JDK-8231222 4 fix pkcs11 P11_DEBUG guarded native traces security-libs / javax.crypto:pkcs11 0
JDK-8231223 3 C2's conditional move optimization fails with assert(bol->Opcode() == Op_Bool) failed hotspot 0
JDK-8231247 3 (zipfs) Test failure in jdk/nio/zipfs/InvalidZipHeaderTests.java after backport of JDK-8222807 core-libs / java.nio 0
JDK-8231254 4 (fs) Add test for macOS Catalina changes to protect system software core-libs / java.nio 0
JDK-8231294 4 ZGC: vmTestbase/nsk/jvmti/ResourceExhausted/resexhausted002 fails hotspot / gc 0
JDK-8231296 4 ZGC: vmTestbase/nsk/jvmti/Allocate/alloc001/ fails hotspot / gc 0
JDK-8231318 3 Several compiler/aot tests fail for JDK11 on Windows when only MSVC 2017 is installed hotspot / compiler 0
JDK-8231336 2 Corrupted option dialog in JTHarness with JDK14b13 client-libs / java.awt 0
JDK-8231403 4 [ppc]: Align ReservedCodeCacheSize default value with other platforms hotspot / compiler 0
JDK-8231422
/ CVE-2020-2604
2 Better serial filter handling Serialization 0
JDK-8231457 4 Asserts on AIX because os::elapsed_counter() is not monotonic hotspot / runtime 0
JDK-8231503 4 [TESTBUG] compiler/{jvmci,aot} tests should not run with GCs that do not support JVMCI/AOT hotspot / compiler 0
JDK-8231665 4 8231055 broke escapeAnalysis/TestSelfArrayCopy.java hotspot / compiler 0
JDK-8231620 2 assert(bol->is_Bool()) crash during split if due to FastLockNode hotspot / compiler 0
JDK-8231751 4 on aix handle Power 9 in os::get_summary_cpu_info hotspot / runtime 0
JDK-8231770 4 Test java/util/zip/FlaterTest.java fails with -Xcheck:jni core-libs 0
JDK-8231780
/ CVE-2020-2655
2 Better TLS messaging support JSSE 0
JDK-8231790 2 Provide better FileSystemProviders 0
JDK-8231885 3 Fix/remove malformed assert in os_windows.cpp hotspot / runtime 0
JDK-8231887 3 Test security/infra/java/security/cert/CertPathValidator/certification/ComodoCA.java fails because certificate was revoked security-libs / java.security 0
JDK-8231930 1 Windows build fails after JDK-8191521 hotspot / runtime 0
JDK-8231949 4 [PPC64, s390]: Make async profiling more reliable hotspot / runtime 0
JDK-8231991 4 Mouse wheel change focus on awt/swing windows client-libs 0
JDK-8231988 2 Unexpected test result caused by C2 IdealLoopTree::do_remove_empty_loop hotspot / compiler 0
JDK-8232005 4 [s390, PPC64] More exception checks missing in interpreter hotspot / runtime 0
JDK-8232051 4 Epsilon should warn about Xms/Xmx/AlwaysPreTouch configuration hotspot / gc 0
JDK-8232019 3 Add LuxTrust certificate updates to the existing root program security-libs / java.security 0
JDK-8232052 4 use string literal for format string when handling PauseAtStartupFile hotspot / runtime 0
JDK-8232121 2 Better numbering system javafx / web 0
JDK-8232128 2 Better formatting for numbers javafx / web 0
JDK-8232178 3 MacVolumesTest failed after upgrade to MacOS Catalina core-libs / java.nio 0
JDK-8232214 2 Improved internal validations javafx / web 0
JDK-8232381 3 add result NULL-checking to freetypeScaler.c client-libs / 2d 0
JDK-8232419 2 Improve Registry registration 0
JDK-8232539 2 SIGSEGV in C2 Node::unique_ctrl_out hotspot / compiler 0
JDK-8232592 4 is shown in jstack mixed mode hotspot / svc-agent 0
JDK-8232879 2 (zipfs) Writing out data with ZipFileSystem leads to a CRC failure in the generated jar file core-libs / java.nio 10
JDK-8232874 5 Add missing test for 8230062 hotspot / compiler 0
JDK-8232984 4 Upgrading Joni License version to 2.1.16 core-libs / jdk.nashorn 0
JDK-8233075 4 JFR - nmetods - misspelled in several places hotspot / jfr 0
JDK-8233081 4 C1: PatchingStub for field access copies too much hotspot / compiler 0
JDK-8233097 2 Fontmetrics for large Fonts has zero width client-libs / 2d 0
JDK-8233202 4 exclude javax/swing/plaf/basic/BasicGraphicsUtils/8132119/bug8132119.java client-libs / 2d 0
JDK-8233223 3 Add Amazon Root CA certificates security-libs / java.security 0
JDK-8233203 3 fix non-product build on AIX when compiling with xlc16/legacy-xlc infrastructure / build 0
JDK-8233404 4 System property to set the number of PBE iterations in JCEKS keystores security-libs 0
JDK-8233820 4 Test crashed with assert(phi->operand_count() != 1 || phi->subst() != phi) failed: missed trivial simplification hotspot / compiler 0
JDK-8233886 3 TEST_BUG jdk/java/net/CookieHandler/B6791927.java hit hardcoded expiration date core-libs / java.net 0
JDK-8233839 4 aarch64: missing memory barrier in NewObjectArrayStub and NewTypeArrayStub hotspot / runtime 0
JDK-8233944 4 Make KerberosPrincipal.KRB_NT_ENTERPRISE field package private security-libs / org.ietf.jgss:krb5 0
JDK-8233954 2 UnsatisfiedLinkError or NoSuchAlgorithmException after removing sunec.dll security-libs / javax.crypto 0
JDK-8234037
/ CVE-2020-2654
2 Improve Object Identifier Processing Libraries 0
JDK-8234080 4 (zipfs) jdk/nio/zipfs/CRCWriteTest.java fails core-libs / java.nio 0
JDK-8234107 3 Several AWT modal dialog tests failing on Linux after JDK-8231991 client-libs / java.awt 0
JDK-8234245 2 sun/security/lib/cacerts/VerifyCACerts.java fails due to wrong checksum security-libs / java.security 0
JDK-8234321 4 Call cache flush after generating trampoline. hotspot / compiler 0
JDK-8234591 4 [11u] Build with old C compiler broken by 8223490 core-libs / java.util 0
JDK-8234645 2 ARM32: C1: PatchingStub for field access: not enough bytes hotspot / compiler 0
JDK-8234625 4 hs test serviceability/sa/ClhsdbCDSCore.java fails on macOS 10.15 hotspot / svc 0
JDK-8234906 4 [TESTBUG] TestDivZeroCheckControl fails for client VMs due to Unrecognized VM option LoopUnrollLimit hotspot / compiler 0
JDK-8235142 4 JDK-8193255 backport broke bootstrap with JDK 10 infrastructure / build 0
JDK-8235585 3 Enable macOS codesigning for all libraries and executables infrastructure / build 0
JDK-8235403 4 Further cleanup to test serviceability/sa/ClhsdbCDSCore.java hotspot / svc 0
JDK-8235687 2 Contents/MacOS/libjli.dylib cannot be a symlink infrastructure / build 0

This section organizes the changes in the selected update release by the main component under which each issue is filed.

Core Libs (51)

Issue
Priority
Title
Component
Voting
JDK-8185898 3 setRequestProperty(key, null) results in HTTP header without colon in request core-libs / java.net 0
JDK-8193325 3 StackFrameInfo::getByteCodeIndex returns wrong value if bci > 32767 core-libs / java.lang 0
JDK-8198882 4 Add 10 JNDI tests to com/sun/jndi/dns/AttributeTests/ core-libs / javax.naming 0
JDK-8200381 5 Typos in javadoc - missing verb "be" and alike core-libs 0
JDK-8208364 3 java/lang/reflect/callerCache/ReflectionCallerCacheTest.java missing module dependencies declaration core-libs / java.lang:reflect 0
JDK-8209003 4 Consolidate use of empty collections in java.lang.module core-libs / java.lang.module 0
JDK-8209178 4 Proxied HttpsURLConnection doesn't send BODY when retrying POST request core-libs / java.net 0
JDK-8210403 4 Refactor java.util.Locale:i18n shell tests to plain java tests core-libs / java.util:i18n 0
JDK-8211385 3 (zipfs) ZipDirectoryStream yields a stream of absolute paths when directory is relative core-libs / java.nio 0
JDK-8211919 3 (zipfs) ZipDirectoryStream should provide a stream of paths that are relative to the directory core-libs / java.nio 0
JDK-8212970 2 TZ database in "vanguard" format support core-libs / java.time 0
JDK-8213406 3 (fs) More than one instance of built-in FileSystem observed in heap core-libs 0
JDK-8215449 4 Several tests failing when jtreg run with -vmoption:--illegal-access=deny core-libs 0
JDK-8215913 4 [Test_bug]java/util/Locale/LocaleProvidersRun.java failed on de_DE and ja_JP locale. core-libs 0
JDK-8216363 4 NullPointerException in java.util.logging.Handler#isLoggable core-libs / java.util.logging 0
JDK-8216561 4 HttpClient: The logic of retry on connect exception is inverted core-libs / java.net 0
JDK-8220598 4 Malformed copyright year range in a few files in java.base core-libs 0
JDK-8221406 4 Windows 32bit build error in NetworkInterface_winXP.c core-libs / java.net 0
JDK-8221395 3 HttpClient leaving connections in CLOSE_WAIT state until Java process ends core-libs / java.net 0
JDK-8222440 3 (zipfs) JarFileSystem does not correctly handle versioned entries if no root entry is present core-libs / java.nio 0
JDK-8222807 3 (zipfs) OutOfMemory on compiling with darcula.jar in classpath core-libs / java.nio 0
JDK-8223490 3 Optimize search algorithm for determining default time zone core-libs / java.util 10
JDK-8224502 4 [TESTBUG] JDK docker test TestSystemMetrics.java fails with access issues and OOM core-libs 0
JDK-8224505 3 TestQuotedLogOutput failure after ProcessBuilder changes core-libs / java.lang 0
JDK-8225425 2 java.lang.UnsatisfiedLinkError: net.dll: Can't find dependent libraries core-libs / java.net 0
JDK-8226869 3 Test java/util/Locale/LocaleProvidersRun.java should enable assertions core-libs / java.util:i18n 0
JDK-8227127 2 Era designator not displayed correctly using the COMPAT provider core-libs / java.text 0
JDK-8227368 3 EnumSet.class serialization broken in JDK 9+ core-libs / java.util:collections 0
JDK-8227391 3 Update double-conversion to version 3.1.5 core-libs / jdk.nashorn 0
JDK-8228434 3 jdk/net/Sockets/Test.java fails after JDK-8227642 core-libs / java.net 0
JDK-8228465 3 HOST locale provider holds wrong era name for GregorianCalendar in US locale core-libs / java.util:i18n 0
JDK-8228469 4 (tz) Upgrade time-zone data to tzdata2019b core-libs / java.time 0
JDK-8228548 2 Normalize normalization for all core-libs / java.net 0
JDK-8229022 4 BufferedReader performance can be improved by using StringBuilder core-libs / java.io 10
JDK-8229872 4 (fs) Increase buffer size used with getmntent core-libs / java.nio 0
JDK-8229899 4 java.io.File.isInvalid() is racy core-libs / java.io 0
JDK-8229887 2 (zipfs) zip file corruption when replacing an existing STORED entry core-libs / java.nio 0
JDK-8230085 2 (fs) FileStore::isReadOnly is always true on macOS Catalina core-libs / java.nio 0
JDK-8230856 4 Java_java_net_NetworkInterface_getByName0 on unix misses ReleaseStringUTFChars in early return core-libs / java.net 0
JDK-8231098 3 (tz) Upgrade time-zone data to tzdata2019c core-libs / java.time 0
JDK-8231124 4 Missing closedir call with JDK-8223490 core-libs / java.util 0
JDK-8231247 3 (zipfs) Test failure in jdk/nio/zipfs/InvalidZipHeaderTests.java after backport of JDK-8222807 core-libs / java.nio 0
JDK-8231254 4 (fs) Add test for macOS Catalina changes to protect system software core-libs / java.nio 0
JDK-8231422 2 Better serial filter handling core-libs / java.io:serialization 0
JDK-8231770 4 Test java/util/zip/FlaterTest.java fails with -Xcheck:jni core-libs 0
JDK-8232178 3 MacVolumesTest failed after upgrade to MacOS Catalina core-libs / java.nio 0
JDK-8232879 2 (zipfs) Writing out data with ZipFileSystem leads to a CRC failure in the generated jar file core-libs / java.nio 10
JDK-8232984 4 Upgrading Joni License version to 2.1.16 core-libs / jdk.nashorn 0
JDK-8233886 3 TEST_BUG jdk/java/net/CookieHandler/B6791927.java hit hardcoded expiration date core-libs / java.net 0
JDK-8234080 4 (zipfs) jdk/nio/zipfs/CRCWriteTest.java fails core-libs / java.nio 0
JDK-8234591 4 [11u] Build with old C compiler broken by 8223490 core-libs / java.util 0

Security Libs (44)

Issue
Priority
Title
Component
Voting
JDK-8080462 3 Update SunPKCS11 provider with PKCS11 v2.40 support security-libs / javax.crypto:pkcs11 0
JDK-8176837 4 SunPKCS11 provider needs to check more details on PKCS11 Mechanism security-libs / javax.crypto:pkcs11 0
JDK-8204203 2 Many pkcs11 tests failed in Provider initialization, after compiler on Windows changed security-libs / javax.crypto:pkcs11 0
JDK-8211866 3 TLS 1.3 CertificateRequest message sometimes offers disallowed signature algorithms security-libs / javax.net.ssl 0
JDK-8212752 4 Typo in SSL log message related to inactive/disabled signature scheme security-libs / javax.net.ssl 0
JDK-8212738 3 Incorrectly named signature scheme ecdsa_secp512r1_sha512 security-libs / javax.net.ssl 0
JDK-8213008 3 Cipher with UNWRAP_MODE should support the generation of an AES key type security-libs / javax.crypto:pkcs11 0
JDK-8214098 2 sun.security.ssl.HandshakeHash.T12HandshakeHash constructor check backwards. security-libs / javax.net.ssl 0
JDK-8214321 4 Misleading code in SSLCipher security-libs / javax.net.ssl 0
JDK-8215032 4 Support Kerberos cross-realm referrals (RFC 6806) security-libs / org.ietf.jgss:krb5 0
JDK-8215524 3 Finished message validation failure should be decrypt_error alert security-libs / javax.net.ssl 0
JDK-8217610 3 TLSv1.3 fail with ClassException when EC keys are stored in PKCS11 security-libs / javax.net.ssl 0
JDK-8219013 3 Update Apache Santuario (XML Signature) to version 2.1.3 security-libs / javax.xml.crypto 0
JDK-8218580 3 endpoint identification algorithm should be case-insensitive security-libs / javax.net.ssl 0
JDK-8221172 4 SunEC specific test is not limited to SunEC security-libs / javax.crypto 0
JDK-8221407 4 Windows 32bit build error in libsunmscapi/security.cpp security-libs / javax.crypto 0
JDK-8224589 4 Improve startup behavior of SecurityProperties security-libs 0
JDK-8225390 4 ProblemList sun/security/pkcs11/sslecc/ClientJSSEServerJSSE.java due to JDK-8161536 security-libs / javax.crypto:pkcs11 0
JDK-8225695 1 32-bit build failures after JDK-8080462 (Update SunPKCS11 provider with PKCS11 v2.40 support) security-libs / javax.crypto:pkcs11 0
JDK-8225745 3 NoSuchAlgorithmException exception for SHA256withECDSA with RSASSA-PSS support security-libs / java.security 0
JDK-8226352 2 Improve Kerberos interop capabilities security-libs / org.ietf.jgss 0
JDK-8226651 3 Setting the mgfHash in CK_RSA_PKCS_PSS_PARAMS has no effect security-libs / javax.crypto:pkcs11 0
JDK-8226719 2 Kerberos login to Windows 2000 failed with "Inappropriate type of checksum in message" security-libs / org.ietf.jgss 0
JDK-8227061 3 KDC.java test behaves incorrectly when AS-REQ contains a PAData not PA-ENC-TS-ENC security-libs / org.ietf.jgss:krb5 0
JDK-8227381 3 GSS login fails with PREAUTH_FAILED security-libs / org.ietf.jgss 0
JDK-8227437 2 S4U2proxy cannot continue because server's TGT cannot be found security-libs / org.ietf.jgss:krb5 0
JDK-8228337 3 problemList failing/ignored manual tests in security-libs security-libs 0
JDK-8228645 4 Don't run sun/security/pkcs11/Cipher/TestKATForGCM.java on buggy NSS solaris versions security-libs / javax.crypto:pkcs11 0
JDK-8228835 3 Memory leak in PKCS11 provider when using AES GCM security-libs / javax.crypto:pkcs11 0
JDK-8229243 3 SunPKCS11-Solaris provider tests failing on Solaris 11.4 security-libs / javax.crypto:pkcs11 0
JDK-8229773 3 Resolve permissions for code source URLs lazily security-libs 0
JDK-8229951 2 Better Ticket Granting Services security-libs / java.security 0
JDK-8230861 4 missing ReleaseStringUTFChars in Java_sun_security_pkcs11_wrapper_PKCS11_connect security-libs / java.security 0
JDK-8230923 3 SunJSSE is not properly initialized in FIPS mode from a configuration file security-libs 0
JDK-8231222 4 fix pkcs11 P11_DEBUG guarded native traces security-libs / javax.crypto:pkcs11 0
JDK-8231780 2 Better TLS messaging support security-libs / javax.net.ssl 0
JDK-8231887 3 Test security/infra/java/security/cert/CertPathValidator/certification/ComodoCA.java fails because certificate was revoked security-libs / java.security 0
JDK-8232019 3 Add LuxTrust certificate updates to the existing root program security-libs / java.security 0
JDK-8233223 3 Add Amazon Root CA certificates security-libs / java.security 0
JDK-8233404 4 System property to set the number of PBE iterations in JCEKS keystores security-libs 0
JDK-8233944 4 Make KerberosPrincipal.KRB_NT_ENTERPRISE field package private security-libs / org.ietf.jgss:krb5 0
JDK-8233954 2 UnsatisfiedLinkError or NoSuchAlgorithmException after removing sunec.dll security-libs / javax.crypto 0
JDK-8234037 2 Improve Object Identifier Processing security-libs / java.security 0
JDK-8234245 2 sun/security/lib/cacerts/VerifyCACerts.java fails due to wrong checksum security-libs / java.security 0

Hotspot (149)

Issue
Priority
Title
Component
Voting
JDK-8048556 3 Unnecessary GCLocker-initiated young GCs hotspot / gc 0
JDK-8190737 3 use unicode version of the canonicalize() function to handle long path on windows hotspot / runtime 0
JDK-8191521 3 handle long relative path specified in -Xbootclasspath/a on windows hotspot / runtime 0
JDK-8202359 3 [GRAAL] compiler/uncommontrap/TestDeoptOOM.java failed with OutOfMemoryError hotspot / compiler 0
JDK-8205516 2 JFR tool hotspot / jfr 0
JDK-8207922 4 ctw of jdk.security.auth failed with "Unexpected zero exit codebefore finishing all compilations" hotspot / compiler 0
JDK-8207263 3 Store the Configuration for system modules into CDS archive hotspot / runtime 0
JDK-8206115 3 Use shared macros for JavaClasses::compute_offsets and MetaspaceShared::serialize_well_known_classes hotspot / runtime 0
JDK-8208582 4 Introduce native oop barriers in C1 for OopHandle hotspot / compiler 0
JDK-8208236 3 [TESTBUG] vmTestbase/nsk/stress/stack tests fail by timeout hotspot / compiler 0
JDK-8208601 4 Introduce native oop barriers in C2 for OopHandle hotspot / compiler 0
JDK-8209647 3 constantPoolHandle::constantPoolHandle(ConstantPool*) when precompiled header is disabled hotspot / runtime 0
JDK-8209545 3 Simplify HeapShared::archive_module_graph_objects hotspot / runtime 0
JDK-8209120 4 Archive the Integer.IntegerCache hotspot / runtime 0
JDK-8209790 3 SA tools not providing option to connect to debug server hotspot / svc-agent 0
JDK-8209691 4 Allow MemBar on single memory slice hotspot / compiler 0
JDK-8210158 4 Accessorize JFR getEventWriter() intrinsics hotspot 0
JDK-8209972 3 [GRAAL] Don't run RTM tests with Graal hotspot / compiler 0
JDK-8209835 4 Aarch64: elide barriers on all volatile operations hotspot 0
JDK-8209833 3 C2 compilation fails with "assert(ex_map->jvms()->same_calls_as(_exceptions->jvms())) failed: all collected exceptions must come from the same place" hotspot / compiler 0
JDK-8210559 3 ClassLoaderData Symbols can leak hotspot 0
JDK-8210387 3 C2 compilation fails with "assert(node->_last_del == _last) failed: must have deleted the edge just produced" hotspot / compiler 0
JDK-8211740 3 [AOT] -XX:AOTLibrary doesn't accept windows path hotspot / compiler 0
JDK-8212673 3 jtreg/applications/runthese/RunThese30M.java fails in C2 with "assert(!had_error) failed: bad dominance" hotspot / compiler 0
JDK-8212627 3 [TESTBUG] runtime/CreateMirror/ArraysNewInstanceBug.java timed out hotspot / runtime 0
JDK-8213014 4 Crash in CompileBroker::make_thread due to OOM hotspot 0
JDK-8213448 3 [TESTBUG] enhance jfr/jvm/TestDumpOnCrash hotspot / jfr 0
JDK-8213381 4 Hook to allow GC to inject Node::Ideal() calls hotspot / compiler 0
JDK-8213604 2 Fix missing includes after JDK-8212673 hotspot / compiler 0
JDK-8214315 2 G1: fatal error: acquiring lock SATB_Q_FL_lock/1 out of order with lock tty_lock/0 hotspot 0
JDK-8214052 4 [testbug] vmTestbase/vm/compiler/CodeCacheInfoOnCompilation - wrong shell used hotspot / compiler 0
JDK-8214750 3 Unnecessary

tags in jfr classes

hotspot / jfr 0
JDK-8214542 3 JFR: Old Object Sample event slow on a deep heap in debug builds hotspot / jfr 0
JDK-8214925 3 [TESTBUG] JFR tool fails to execute hotspot / jfr 0
JDK-8214896 1 JFR Tool left files behind hotspot / jfr 0
JDK-8214773 4 Replace use of thread unsafe strtok hotspot / compiler 0
JDK-8214975 3 No hs-err file if fatal error is raised during dynamic initialization. hotspot 0
JDK-8215771 3 The jfr tool should pretty print reference chains hotspot / jfr 0
JDK-8215755 2 ZGC: split_barrier_thru_phi: check number of inputs of phi hotspot / compiler 0
JDK-8215708 2 ZGC: Add missing LoadBarrierNode::size_of() hotspot / compiler 0
JDK-8215699 3 -Xlog::file cannot be used with named pipe hotspot 0
JDK-8216135 2 C2 assert(!had_error) failed: bad dominance hotspot / compiler 0
JDK-8216064 3 -XX:StartFlightRecording:settings= doesn't work properly hotspot / jfr 0
JDK-8216426 4 Usage of array placement new may lead to memory corruption hotspot / runtime 0
JDK-8216283 3 Allow shorter method sampling interval than 10 ms hotspot / jfr 0
JDK-8216977 4 ShowHiddenFrames use in java_lang_StackTraceElement::fill_in appears broken hotspot / runtime 0
JDK-8217362 4 Emergency dump does not work when disk=false is set hotspot / jfr 0
JDK-8218468 3 Load barrier slow path node should be MachTypeNode hotspot / compiler 0
JDK-8218935 4 Make jfr strncpy uses GCC 8.x friendly hotspot / jfr 0
JDK-8220394 3 bufferedStream does not honor size limit hotspot 0
JDK-8220352 3 [TESTBUG] Crash with assert(external_guard || result != __null) failed: Invalid JNI handle hotspot / jvmti 0
JDK-8220555 4 JFR tool shows potentially misleading message when it cannot access a file hotspot / jfr 0
JDK-8221092 3 UseAVX=3 has performance degredation on Skylake (X7) processors hotspot / compiler 0
JDK-8221539 4 [metaspace] Improve MetaspaceObj::is_metaspace_obj() and friends hotspot / runtime 0
JDK-8221532 4 Incorrect copyright header in FileSystemSupport_md.c hotspot / svc 0
JDK-8221456 4 nmethod::make_unloaded() clears _method member too early hotspot 0
JDK-8221711 3 [TESTBUG] create more tests for JFR in container environment hotspot / jfr 0
JDK-8221569 3 JFR tool produces incorrect output when both --categories and --events are specified hotspot / jfr 0
JDK-8222015 4 Small VM.metaspace improvements hotspot / runtime 0
JDK-8221913 4 Add GC.selected() jtreg-ext function hotspot / gc 0
JDK-8222154 4 upgrade gtest to 1.8.1 hotspot 0
JDK-8223438 4 add VirtualizationInformation JFR event hotspot 0
JDK-8222888 4 [TESTBUG] docker/TestJFREvents.java fails due to "RuntimeException: JAVA_MAIN_CLASS_* is not defined" hotspot / runtime 0
JDK-8223697 3 jfr tool can't format duration values greater than 1 minute hotspot / jfr 0
JDK-8224217 3 RecordingInfo should use textual representation of path hotspot / jfr 0
JDK-8224193 3 stringStream should not use Resource Area hotspot / runtime 0
JDK-8224538 3 LoadBarrierNode::common_barrier must check address hotspot / compiler 0
JDK-8225004 3 Remove invalid assertion in jfr_conditional_flush() hotspot / jfr 0
JDK-8224958 4 add os::dll_load calls to event log hotspot / runtime 0
JDK-8225225 4 stringStream internal buffer should always be zero terminated hotspot 0
JDK-8225694 3 Destination option missing in FlightRecorderMXBeanImpl hotspot / jfr 0
JDK-8226779 3 [TESTBUG] Test JFR API from Java agent hotspot / jfr 0
JDK-8226899 3 Problemlist compiler/rtm tests hotspot / compiler 0
JDK-8227035 4 JVM::printFlags fails in native OOM situations hotspot 0
JDK-8227032 4 MetaspaceUtils::print_report crashes when called before initialization hotspot 0
JDK-8227031 4 Print NMT statistics on fatal errors hotspot / runtime 0
JDK-8227086 4 Use AS_NO_KEEPALIVE loads in HeapDumper hotspot 0
JDK-8227338 4 templateInterpreter.cpp: copy_table() needs to be safer hotspot 0
JDK-8227411 3 TestTimeMultiple.java failed "assert(!lease()) failed: invariant" hotspot / jfr 0
JDK-8227439 3 Turn off AOT by default hotspot / compiler 0
JDK-8227642 4 [TESTBUG] Make docker tests podman compatible hotspot 0
JDK-8227605 2 Kitchensink fails "assert((((klass)->trace_id() & (JfrTraceIdEpoch::leakp_in_use_this_epoch_bit())) != 0)) failed: invariant" hotspot / jfr 0
JDK-8228625 4 [TESTBUG] sun/tools/jhsdb/JShellHeapDumpTest.java fails with RuntimeException 'JShellToolProvider' missing from stdout/stderr hotspot / svc-agent 0
JDK-8228687 4 [TESTBUG] exclude Container tests from hotspot_misc group hotspot 0
JDK-8228772 3 C2 compilation fails due to unschedulable graph if DominatorSearchLimit is reached hotspot / compiler 0
JDK-8228834 2 Regression caused by JDK-8214542 not installing complete checkpoint data to candidates hotspot / jfr 0
JDK-8228888 3 C2 compilation fails with assert "m has strange control" hotspot / compiler 0
JDK-8228902 3 add os::dll_load to the unified logging os category hotspot / runtime 0
JDK-8229016 2 C2 scalarization crashes with assert(node->Opcode() == Op_CastP2X) failed: ConvP2XNode required hotspot / compiler 0
JDK-8229020 4 Failure on CPUs allowing loads reordering: assert(_tasks[t] == 1) failed: What else? hotspot / gc 0
JDK-8229156 4 ProblemList gc/stress/gclocker/TestExcessGCLockerCollections.java hotspot / gc 0
JDK-8229169 4 False failure of GenericTaskQueue::pop_local on architectures with weak memory model hotspot / gc 0
JDK-8229182 3 [TESTBUG] runtime/containers/docker/TestMemoryAwareness.java test fails on SLES12 hotspot 0
JDK-8229284 4 [TESTBUG] jdk/internal/platform/cgroup/TestCgroupMetrics.java fails for - memory:getMemoryUsage hotspot / runtime 0
JDK-8229420 3 [Redo] jstat reports incorrect values for OU for CMS GC hotspot / gc 0
JDK-8229437 2 assert(is_aligned(ref, HeapWordSize)) failed: invariant hotspot / jfr 0
JDK-8229450 2 C2 compilation fails with assert(found_sfpt) failed: no node in loop that's not input to safepoint hotspot / compiler 0
JDK-8229483 3 Sinking load out of loop may trigger: assert(found_sfpt) failed: no node in loop that's not input to safepoint hotspot / compiler 0
JDK-8229496 2 SIGFPE (division by zero) in C2 OSR compiled method hotspot / compiler 0
JDK-8229701 2 aarch64: C2 OSR compilation fails with "shouldn't process one node several times" in final graph reshaping hotspot / compiler 0
JDK-8230061 2 # assert(mode == ControlAroundStripMined && use == sfpt) failed: missed a node hotspot / compiler 0
JDK-8230062 2 assert(i == p->size()-1) failed: must be last element of the pack hotspot / compiler 0
JDK-8230110 4 TestLinkageErrorInGenerateOopMap times out hotspot 0
JDK-8230115 4 Problemlist JFR TestNetworkUtilization test hotspot / jfr 0
JDK-8230238 4 Add another regression test for JDK-8134739 hotspot / compiler 0
JDK-8230363 3 C2: Let ConnectionGraph::not_global_escape(Node* n) return false if n is not in the CG hotspot / compiler 0
JDK-8230376 4 [TESTBUG] runtime/StackTrace/HiddenFrameTest.java fails with release VM hotspot / runtime 0
JDK-8230388 4 Problemlist additional compiler/rtm tests hotspot / compiler 0
JDK-8230466 4 check malloc/calloc results in jdk.hotspot.agent hotspot 0
JDK-8230646 3 Epsilon does not extend TLABs to max size hotspot 0
JDK-8230669 3 [s390] C1: assert(is_bound() || is_unused()) failed: Label was never bound to a location, but it was used as a jmp target hotspot / compiler 0
JDK-8230671 1 x86_32 build failures after JDK-8229496 hotspot / compiler 0
JDK-8230711 3 ConnectionGraph::unique_java_object(Node* N) return NULL if n is not in the CG hotspot / compiler 0
JDK-8230813 4 Add JDK-8010500 to compiler/loopopts/superword/TestFuzzPreLoop.java bug list hotspot / compiler 0
JDK-8230850 3 Test sun/tools/jcmd/TestProcessHelper.java fails intermittently hotspot 0
JDK-8230881 3 serviceability/sa/TestJmapCore tests fail with java.lang.RuntimeException: Could not find dump file hotspot / svc-agent 0
JDK-8230943 4 False deadlock detection with -XX:+CIPrintCompileQueue after JDK-8163511 hotspot / compiler 0
JDK-8231055 2 C2: arraycopy with same non escaping src and dest but different positions causes wrong execution hotspot / compiler 0
JDK-8231085 4 C2/GC: Better GC-interface for expanding clone hotspot / compiler 0
JDK-8231201 4 hs_err should print coalesced safepoint operations in Events section hotspot / runtime 0
JDK-8231223 3 C2's conditional move optimization fails with assert(bol->Opcode() == Op_Bool) failed hotspot 0
JDK-8231294 4 ZGC: vmTestbase/nsk/jvmti/ResourceExhausted/resexhausted002 fails hotspot / gc 0
JDK-8231296 4 ZGC: vmTestbase/nsk/jvmti/Allocate/alloc001/ fails hotspot / gc 0
JDK-8231318 3 Several compiler/aot tests fail for JDK11 on Windows when only MSVC 2017 is installed hotspot / compiler 0
JDK-8231403 4 [ppc]: Align ReservedCodeCacheSize default value with other platforms hotspot / compiler 0
JDK-8231457 4 Asserts on AIX because os::elapsed_counter() is not monotonic hotspot / runtime 0
JDK-8231503 4 [TESTBUG] compiler/{jvmci,aot} tests should not run with GCs that do not support JVMCI/AOT hotspot / compiler 0
JDK-8231665 4 8231055 broke escapeAnalysis/TestSelfArrayCopy.java hotspot / compiler 0
JDK-8231620 2 assert(bol->is_Bool()) crash during split if due to FastLockNode hotspot / compiler 0
JDK-8231751 4 on aix handle Power 9 in os::get_summary_cpu_info hotspot / runtime 0
JDK-8231885 3 Fix/remove malformed assert in os_windows.cpp hotspot / runtime 0
JDK-8231930 1 Windows build fails after JDK-8191521 hotspot / runtime 0
JDK-8231949 4 [PPC64, s390]: Make async profiling more reliable hotspot / runtime 0
JDK-8231988 2 Unexpected test result caused by C2 IdealLoopTree::do_remove_empty_loop hotspot / compiler 0
JDK-8232005 4 [s390, PPC64] More exception checks missing in interpreter hotspot / runtime 0
JDK-8232051 4 Epsilon should warn about Xms/Xmx/AlwaysPreTouch configuration hotspot / gc 0
JDK-8232052 4 use string literal for format string when handling PauseAtStartupFile hotspot / runtime 0
JDK-8232539 2 SIGSEGV in C2 Node::unique_ctrl_out hotspot / compiler 0
JDK-8232592 4 is shown in jstack mixed mode hotspot / svc-agent 0
JDK-8232874 5 Add missing test for 8230062 hotspot / compiler 0
JDK-8233075 4 JFR - nmetods - misspelled in several places hotspot / jfr 0
JDK-8233081 4 C1: PatchingStub for field access copies too much hotspot / compiler 0
JDK-8233820 4 Test crashed with assert(phi->operand_count() != 1 || phi->subst() != phi) failed: missed trivial simplification hotspot / compiler 0
JDK-8233839 4 aarch64: missing memory barrier in NewObjectArrayStub and NewTypeArrayStub hotspot / runtime 0
JDK-8234321 4 Call cache flush after generating trampoline. hotspot / compiler 0
JDK-8234645 2 ARM32: C1: PatchingStub for field access: not enough bytes hotspot / compiler 0
JDK-8234625 4 hs test serviceability/sa/ClhsdbCDSCore.java fails on macOS 10.15 hotspot / svc 0
JDK-8234906 4 [TESTBUG] TestDivZeroCheckControl fails for client VMs due to Unrecognized VM option LoopUnrollLimit hotspot / compiler 0
JDK-8235403 4 Further cleanup to test serviceability/sa/ClhsdbCDSCore.java hotspot / svc 0

Client Libs (41)

Issue
Priority
Title
Component
Voting
JDK-8134672 4 [TEST_BUG] Some tests should check isDisplayChangeSupported client-libs 0
JDK-8146238 3 [macosx] Java2D Queue Flusher crash on OSX after switching between user accounts client-libs / 2d 0
JDK-8144125 4 [macos] java/awt/event/ComponentEvent/MovedResizedTwiceTest/MovedResizedTwiceTest.java failed automatically client-libs / java.awt 0
JDK-8208179 3 Devanagari not shown with logical fonts on Windows after removal of Lucida Sans from JDK client-libs / 2d 0
JDK-8210384 3 SunLayoutEngine.isAAT() font is expensive on MacOS client-libs / 2d 0
JDK-8210776 2 Upgrade X Window System 6.8.2 to the latest XWD 1.0.7 client-libs 0
JDK-8211147 4 Incorrect comparator com.sun.beans.introspect.MethodInfo.MethodOrder client-libs / java.beans 0
JDK-8211992 3 GraphicsConfiguration.getDevice().getDisplayMode() causes JVM crash on Mac client-libs / java.awt 0
JDK-8212071 3 Need to set the FreeType LCD Filter to reduce fringing. client-libs / 2d 0
JDK-8213119 2 [macos] java/awt/GraphicsDevice/CheckDisplayModes.java fails client-libs / java.awt 0
JDK-8214046 2 [macosx] Undecorated Frame does not Iconify when set to client-libs / java.awt 0
JDK-8213568 4 Typo in java/awt/GraphicsEnvironment/LoadLock/GE_init5.java client-libs / 2d 0
JDK-8215200 3 IllegalArgumentException in sun.lwawt.macosx.CPlatformWindow client-libs / java.awt 0
JDK-8215105 3 java/awt/Robot/HiDPIScreenCapture/ScreenCaptureTest.java: Wrong Pixel Color client-libs 0
JDK-8217731 3 Font rendering and glyph spacing changed from jdk-8 to jdk-11 client-libs / 2d 0
JDK-8219504 4 Test for JDK-8211435 can be run on all platforms client-libs 0
JDK-8220231 4 Cache HarfBuzz face object for same font's text layout calls client-libs / 2d 0
JDK-8219914 3 Change the environment variable for Java Access Bridge logging to have a directory client-libs / javax.accessibility 0
JDK-8220528 3 [AIX] Fix basic Xinerama and Xrender functionality client-libs 0
JDK-8221246 3 NullPointerException within Win32ShellFolder2 client-libs / java.awt 0
JDK-8224152 4 [macOS] ProblemList tests that leave rubbish on the screen client-libs / java.awt 0
JDK-8223869 4 Problem list java/awt/FontMetrics/MaxAdvanceIsMax.java on more platforms client-libs / 2d 0
JDK-8224909 2 Unlink Set of LinkedHashSets client-libs / java.beans 0
JDK-8225101 3 Crash at sun.awt.X11.XlibWrapper.XkbGetUpdatedMap when change keybord map client-libs / java.awt 0
JDK-8225505 3 ctrl-F1 does not show the tooltip of a menu item (JMenuItems) client-libs / javax.swing 0
JDK-8226513 3 JEditorPane is shown with incorrect size client-libs 0
JDK-8228368 4 avoid incompatible pointer to integer conversion initializing gint in gtk2_interface client-libs 0
JDK-8229515 4 [macos] access to window property of NSView on wrong thread client-libs / java.awt 0
JDK-8229810 3 [macos] NullPointerException getting bounds of GraphicsConfiguration client-libs / java.awt 0
JDK-8229800 2 WindowsServerCore 1809 does not provide d2d1.dll library required by awt.dll client-libs / 2d 0
JDK-8230728 3 Thin stroked shapes are not rendered if affine transform has flip bit client-libs 0
JDK-8230769 3 BufImg_SetupICM add ReleasePrimitiveArrayCritical call in early return client-libs / 2d 0
JDK-8230782 3 Robot.createScreenCapture() fails if “awt.robot.gtk” is set to false client-libs / java.awt 0
JDK-8230873 3 [AIX] GUI app does not work with UTF-8 locale on minimum software requirements client-libs / java.awt 0
JDK-8230900 4 missing ReleaseStringUTFChars in java.desktop native code client-libs 0
JDK-8231336 2 Corrupted option dialog in JTHarness with JDK14b13 client-libs / java.awt 0
JDK-8231991 4 Mouse wheel change focus on awt/swing windows client-libs 0
JDK-8232381 3 add result NULL-checking to freetypeScaler.c client-libs / 2d 0
JDK-8233097 2 Fontmetrics for large Fonts has zero width client-libs / 2d 0
JDK-8233202 4 exclude javax/swing/plaf/basic/BasicGraphicsUtils/8132119/bug8132119.java client-libs / 2d 0
JDK-8234107 3 Several AWT modal dialog tests failing on Linux after JDK-8231991 client-libs / java.awt 0

Other (40)

Issue
Priority
Title
Component
Voting
JDK-8016914 3 CoreDocumentImpl.setXmlVersion NPE xml / javax.xml.parsers 0
JDK-8193255 4 Root Certificates should be stored in text format and assembled at build time infrastructure / build 0
JDK-8209771 4 jdk.test.lib.Utils::runAndCheckException error other-libs / other 0
JDK-8211037 4 Load jib jars dynamically from JibArtifactResolver infrastructure 0
JDK-8210789 4 langtools/tools/javac/T8152616.java missing @modules tools / javac 0
JDK-8212028 2 Use run-test makefile framework for testing in Oracle's Mach5 infrastructure / build 0
JDK-8213005 2 Missing symbols in hs_err files on Windows after JDK-8212028 infrastructure 0
JDK-8214311 4 dtrace gensrc has missing dependencies infrastructure / build 0
JDK-8215411 3 some GetByteArrayElements calls miss corresponding Release other-libs 0
JDK-8220175 3 serviceability/dcmd/framework/VMVersionTest.java fails with a timeout core-svc 0
JDK-8220476 4 Incorrect GPL header in src/jdk.internal.jvmstat/share/classes/sun/jvmstat/perfdata/monitor/protocol/local/PerfDataFile.java core-svc 0
JDK-8220474 4 Incorrect GPL header in src/java.instrument/share/classes/java/lang/instrument/package-info.java core-svc / java.lang.instrument 0
JDK-8222529 4 sun.jdwp.listenerAddress agent property uses wrong encoding core-svc 0
JDK-8224157 4 BCEL: update to version 6.3.1 xml / jaxp 0
JDK-8225279 2 Better XRender interpolation 0
JDK-8225261 2 Better method resolutions 0
JDK-8225392 3 Comparison builds are failing due to cacerts file infrastructure / build 0
JDK-8227397 4 Add --with-extra-asflags configure option infrastructure / build 0
JDK-8227435 4 Perf::attach() should not throw a java.lang.Exception core-svc 0
JDK-8227473 2 Improve gstreamer media support javafx / media 0
JDK-8227758 2 More valid PKIX processing 0
JDK-8227816 2 More Colorful ICC profiles 0
JDK-8229408 4 Bump update version for OpenJDK: jdk-11.0.6 infrastructure 0
JDK-8229728 2 Implement negotiation parameters 0
JDK-8230279 2 Improve Pack200 file reading 0
JDK-8230303 3 JDB hangs when running monitor command core-svc / debugger 0
JDK-8230318 2 Better trust store usage 0
JDK-8230901 4 missing ReleaseStringUTFChars in serviceability native code core-svc 0
JDK-8230967 2 Improve Registry support of clients 0
JDK-8231129 2 More glyph images 0
JDK-8231139 2 Improved keystore support 0
JDK-8231790 2 Provide better FileSystemProviders 0
JDK-8232121 2 Better numbering system javafx / web 0
JDK-8232128 2 Better formatting for numbers javafx / web 0
JDK-8232214 2 Improved internal validations javafx / web 0
JDK-8232419 2 Improve Registry registration 0
JDK-8233203 3 fix non-product build on AIX when compiling with xlc16/legacy-xlc infrastructure / build 0
JDK-8235142 4 JDK-8193255 backport broke bootstrap with JDK 10 infrastructure / build 0
JDK-8235585 3 Enable macOS codesigning for all libraries and executables infrastructure / build 0
JDK-8235687 2 Contents/MacOS/libjli.dylib cannot be a symlink infrastructure / build 0

This section summarizes JDK Common Vulnerabilities and Exposure (CVE) fixes in the selected update release.

CVE Fixes (7)

CVE
Component
Protocol
CVSS Version 3.0 Risk (see Risk Matrix Definitions)
Base Score
Attack Vector
Attack Complex
Privs Req'd
User Interact
Scope
Confidentiality
Integrity
Availability
Notes
CVE-2020-2604
/ JDK-8231422
Serialization Multiple 8.1 Network High None None Unchanged High High High Note 1 *
CVE-2020-2601
/ JDK-8229951
Security Kerberos 6.8 Network High None None Changed High None None Note1 *
CVE-2020-2655
/ JDK-8231780
JSSE HTTPS 4.8 Network High None None Unchanged Low Low None Note 1 *
CVE-2020-2593
/ JDK-8228548
Networking Multiple 4.8 Network High None None Unchanged Low Low None Note 1 *
CVE-2020-2654
/ JDK-8234037
Libraries Multiple 3.7 Network High None None Unchanged None None Low Note 2 *
CVE-2020-2590
/ JDK-8226352
Security Kerberos 3.7 Network High None None Unchanged None Low None Note 1 *
CVE-2020-2583
/ JDK-8224909
Serialization Multiple 3.7 Network High None None Unchanged None None Low Note 1 *

Notes:

ID Notes
1 This vulnerability applies to Java deployments that load and run untrusted code (e.g., code that comes from the internet) and rely on the Java sandbox for security. This vulnerability does not apply to Java deployments, typically in servers, that load and run only trusted code (e.g., code installed by an administrator).
2 This vulnerability can only be exploited by supplying data to APIs in the specified Component without using untrusted code executed under Java sandbox restrictions, such as through a web service.
3 This vulnerability applies to client and server deployment of Java. This vulnerability can be exploited through untrusted code executed under Java sandbox restrictions. It can also be exploited by supplying data to APIs in the specified Component without using untrusted code executed under Java sandbox restrictions, such as through a web service.
  • ID: 1

    Notes: This vulnerability applies to Java deployments that load and run untrusted code (e.g., code that comes from the internet) and rely on the Java sandbox for security. This vulnerability does not apply to Java deployments, typically in servers, that load and run only trusted code (e.g., code installed by an administrator).

  • ID: 2

    Notes: This vulnerability can only be exploited by supplying data to APIs in the specified Component without using untrusted code executed under Java sandbox restrictions, such as through a web service.

  • ID: 3

    Notes: This vulnerability applies to client and server deployment of Java. This vulnerability can be exploited through untrusted code executed under Java sandbox restrictions. It can also be exploited by supplying data to APIs in the specified Component without using untrusted code executed under Java sandbox restrictions, such as through a web service.

Security-Related Non-CVE (12)

Issue
Priority
Title
Component
JDK-8225279 2 Better XRender interpolation
JDK-8225261 2 Better method resolutions
JDK-8227758 2 More valid PKIX processing
JDK-8227816 2 More Colorful ICC profiles
JDK-8229728 2 Implement negotiation parameters
JDK-8230279 2 Improve Pack200 file reading
JDK-8230318 2 Better trust store usage
JDK-8230967 2 Improve Registry support of clients
JDK-8231129 2 More glyph images
JDK-8231139 2 Improved keystore support
JDK-8231790 2 Provide better FileSystemProviders
JDK-8232419 2 Improve Registry registration