This section lists and comments on the highlights of the changes in the selected update release.

Issue
Priority
Title
Component
Foojay Commentary
Category
Voting
JDK-8237508 4 Simplify JarFile.isInitializing core-libs / java.util.jar

For small applications, this noticeably solves a regression in startup and footprint.

performance 11
JDK-8218889 3 Improperly use of the Optional API security-libs / javax.net.ssl

Fix for an error in ‘sun.security.ssl.SSLHandshake.produce’, reported by the SAP community and by the Tomcat community.

fix 10
JDK-8223260 3 NamingManager should cache InitialContextFactory core-libs / javax.naming

Around 8% performance gain from stress scenario in search for ServiceProvider, instead of !InitialContext, to be used with NamingManager.

performance 10
JDK-8229888 4 (zipfs) Updating an existing zip file does not preserve original permissions core-libs / java.nio

Updating an existing ZIP file with zipfs will re-create the ZIP file without preserving the original file permissions. The permissions are also problematic for new files when it moves/copies the ZIP file from the temporary location.

fix 10
JDK-8230235 2 Rendering HTML with empty img attribute and documentBaseKey cause Exception client-libs / javax.swing

Rendering a Label using HTML text causes a NullPointerException when the img attribute is empty and the JComponent has a custom image base URL (BasicHTML.documentBaseKey).

fix 10
JDK-8232370 4 Refactor some com.sun.jdi tests to enable IDE integration core-svc / debugger

Fixes ambiguous naming of com.sun.jdi tests that cause problems in Eclipse IDE, as well as potentially other tools.

fix 10
JDK-8234423 3 Modifying ArrayList.subList().subList() resets modCount of subList core-libs / java.util:collections

When a sublist of a sublist of an ArrayList is created, the modification count is copied from the parent sublist, not the root ArrayList. This prevents concurrent modifications being correctly detected.

fix 10
JDK-8234610 2 MaxVectorSize set wrongly when UseAVX=3 is specified after JDK-8221092 hotspot / compiler

On systems with Skylake processors (that support AVX-512 instructions and registers), the -XX:UseAVX=3 option can be used to enable this. The MaxVector Size was being set to 16 bytes rather than the correct value of 64 bytes.

fix 10
JDK-8068184 2 Fix for JDK-8032832 caused a deadlock core-libs / java.net

A previous fix that introduced additional class loader synchronization causes a deadlock in NetBeans IDE. The previous fix, which was only for the Browser Plugin (that is no longer supported) has now been reverted.

fix 10
JDK-8237368 2 Problem with NullPointerException in RMI TCPEndpoint.read core-libs / java.rmi

Fixes a regression caused by Jan 2020 CPU resulting in NPE exceptions. It adds a missing check for null to avoid the exception.

fix 10
JDK-8218662 1 Allow 204 responses with Content-Length:0 core-libs / java.net

HTTP has a response code, 204, that indicates No Content. Responses that included a Content-Length field with a value of zero were being rejected. RFC-2616 (HTTP 1.1) does not explicitly disallow a Content-Length of zero (only that there should be no message body). Making this change solves compatibility issues with popular servers.

fix 10
JDK-8238534 3 Deep sign macOS bundles before bundle archive is being created infrastructure

Fulfill Apple notarization code signing prerequisites.

fix 10
JDK-8232170 4 FSInfo#getJarClassPath throws an exception not declared in its throws clause tools 1
JDK-8216354 3 Syntax error in toolchain_windows.m4 infrastructure / build 1

This section lists all the changes in the selected update release.

Issue
Priority
Title
Component
Voting
JDK-4919790 4 Errors in alert ssl message does not reflect the actual certificate status security-libs / javax.net.ssl 0
JDK-4949105 3 Access Bridge lacks html tags parsing client-libs / javax.accessibility 0
JDK-7092821 3 java.security.Provider.getService() is synchronized and became scalability bottleneck security-libs / java.security 0
JDK-7143743 4 (zipfs) Potential memory leak with zip provider core-libs / java.nio 0
JDK-8005819 4 Support cross-realm MSSFU security-libs / org.ietf.jgss:krb5 0
JDK-8042383 4 [TEST_BUG] Test javax/swing/plaf/basic/BasicMenuUI/4983388/bug4983388.java fails with shortcuts on menus do not work client-libs / javax.swing 0
JDK-8068184 2 Fix for JDK-8032832 caused a deadlock core-libs / java.net 10
JDK-8145845 3 [AOT] NullPointerException in compiler/whitebox/GetCodeHeapEntriesTest.java hotspot / compiler 0
JDK-8160926 3 FLAGS_COMPILER_CHECK_ARGUMENTS doesn't handle cross-compilation infrastructure / build 0
JDK-8152988 3 [AOT] Update test batch definitions to include aot-ed java.base module mode into hs-comp testing hotspot / compiler 0
JDK-8163083 3 SocketListeningConnector does not allow invocations with port 0 core-svc / debugger 0
JDK-8163251 3 Hard coded loop limit prevents reading of smart card data greater than 8k security-libs / javax.smartcardio 0
JDK-8167276 5 jvmci/compilerToVM/MaterializeVirtualObjectTest.java fails with -XX:-EliminateAllocations hotspot / compiler 0
JDK-8169718 3 nsk/jdb/locals/locals002: ERROR: Cannot find boolVar with expected value: false core-svc / debugger 0
JDK-8176556 4 java/awt/dnd/ImageTransferTest/ImageTransferTest.java fails for JFIF client-libs / java.awt 0
JDK-8178798 4 Two compiler/aot/verification/vmflags tests fail by timeout with UseAVX=3 hotspot / compiler 0
JDK-8183107 3 PKCS11 regression regarding checkKeySize security-libs / javax.crypto:pkcs11 0
JDK-8185005 4 Improve performance of ThreadMXBean.getThreadInfo(long ids[], int maxDepth) core-svc / java.lang.management 0
JDK-8189633 4 Missing -Xcheck:jni checking for DeleteWeakGlobalRef hotspot / runtime 0
JDK-8189861 4 Refactor CacheFind infrastructure / build 0
JDK-8193042 4 NativeLookup::lookup_critical_entry() should only load shared library once hotspot / compiler 0
JDK-8193596 4 java/net/DatagramPacket/ReuseBuf.java failed due to timeout core-libs / java.net 0
JDK-8194944 4 Regression automated test 'open/test/jdk/javax/swing/JInternalFrame/8145896/TestJInternalFrameMaximize.java' fails client-libs / javax.swing 0
JDK-8196467 4 javax/swing/JInternalFrame/Test6325652.java fails client-libs / javax.swing 0
JDK-8196969 3 JTreg Failure: serviceability/sa/ClhsdbJstack.java causes NPE hotspot / svc-agent 0
JDK-8198321 4 javax/swing/JEditorPane/5076514/bug5076514.java fails client-libs / javax.swing 0
JDK-8198398 4 Test javax/swing/JColorChooser/Test6199676.java fails in mach5 client-libs / javax.swing 0
JDK-8199072 4 Test javax/swing/GroupLayout/6613904/bug6613904.java is unstable client-libs / javax.swing 0
JDK-8200432 3 javadoc fails with ClassCastException on {@link byte[]} tools / javadoc(tool) 0
JDK-8201349 4 build broken when configured with --with-zlib=bundled on gcc 7.3 infrastructure / build 0
JDK-8201355 4 Avoid native memory allocation in sun.security.mscapi.PRNG.generateSeed security-libs / javax.crypto 0
JDK-8201513 4 nsk/jvmti/IterateThroughHeap/filter-* are broken hotspot / jvmti 0
JDK-8203364 4 Some serviceability/sa/ tests intermittently fail with java.io.IOException: LingeredApp terminated with non-zero exit code 3 hotspot / svc-agent 0
JDK-8203687 3 javax/net/ssl/compatibility/Compatibility.java supports TLS 1.3 security-libs / javax.net.ssl 0
JDK-8203904 4 javax/swing/JSplitPane/4816114/bug4816114.java: The divider location is wrong client-libs / javax.swing 0
JDK-8203911 4 Test runtime/modules/getModuleJNI/GetModule fails with -Xcheck:jni hotspot / runtime 0
JDK-8204525 3 [TESTBUG] runtime/NMT/MallocStressTest.java ran out of java heap hotspot / runtime 0
JDK-8204529 3 gc/TestAllocateHeapAtMultiple.java fail with Agent 7 timed out hotspot / gc 0
JDK-8204551 4 Event descriptions are truncated in logs hotspot / runtime 0
JDK-8206963 3 [AOT] bug with multiple class loaders hotspot / compiler 0
JDK-8207367 4 10 vmTestbase/nsk/jdi tests timed out when running with jtreg hotspot / svc 0
JDK-8207832 2 serviceability/sa/ClhsdbCDSCore.java failed with java.lang.Error: Couldn't find core file location in: hotspot / runtime 0
JDK-8207938 3 At step6,Click Add button,case failed automatically. client-libs / java.awt 0
JDK-8208157 3 requires.VMProps throws NPE for missing properties in "release" file hotspot / test 0
JDK-8208379 3 compiler/jvmci/events/JvmciNotifyInstallEventTest.java failed with "Got unexpected event count after 2nd install attempt: expected 9 to equal 2" hotspot / compiler 0
JDK-8208658 3 Make CDS archived heap regions usable even if compressed oop encoding has changed hotspot / runtime 0
JDK-8208715 4 Conversion of milliseconds to nanoseconds in UNIXProcess contains bug. core-libs / java.lang 0
JDK-8209361 3 [AOT] Unexpected number of references for JVMTI_HEAP_REFERENCE_CONSTANT_POOL [111-->111]: 0 (expected at least 1) hotspot / jvmti 0
JDK-8209385 3 CDS runtime classpath checking is too strict when only classes from the system modules are archived hotspot / runtime 0
JDK-8209389 3 SIGSEGV in WalkOopAndArchiveClosure::do_oop_work hotspot / runtime 0
JDK-8209418 3 Synchronize test/jdk/sanity/client/lib/jemmy with code-tools/jemmy/v2 client-libs / javax.swing 0
JDK-8209494 3 Create a test for SwingSet3 InternalFrameDemo client-libs / javax.swing 0
JDK-8209499 3 Create test for SwingSet3 EditorPaneDemo client-libs / javax.swing 0
JDK-8209574 3 [AOT] breakpoint events are generated in different threads does not meet expected count when testcase vm/jvmti/Breakpoint/brkp001/brkp00102/brkp00102.html is executed hotspot / compiler 0
JDK-8209657 3 Refactor filemap.hpp to simplify integration with Serviceability Agent hotspot / runtime 0
JDK-8209686 4 cleanup arguments to PhaseIdealLoop() constructor hotspot / compiler 0
JDK-8209789 3 Synchronize test/jdk/sanity/client/lib/jemmy with code-tools/jemmy/v2 client-libs / javax.swing 0
JDK-8209802 4 Garbage collectors should register JFR types themselves to avoid build errors. hotspot / gc 0
JDK-8209807 4 improve handling exception in requires.VMProps hotspot / test 0
JDK-8209817 3 stack is executable when building with Clang on Linux infrastructure / build 0
JDK-8209824 4 Improve the code coverage for ThreadLocal core-libs / java.lang 0
JDK-8209826 3 Undefined reference to os::write after JDK-8209657 (filemap.hpp cleanup) hotspot / runtime 0
JDK-8209850 4 Allow NamedThreads to use GlobalCounter critical sections hotspot / runtime 0
JDK-8209976 4 Improve iteration over non-JavaThreads hotspot / runtime 0
JDK-8209993 3 Create a test for SwingSet3 ToolTipDemo client-libs / javax.swing 0
JDK-8210024 4 JFR calls virtual is_Java_thread from ~Thread() hotspot / jfr 0
JDK-8210052 3 Enable testing for all the available look and feels in SwingSet3 demo tests client-libs / javax.swing 0
JDK-8210057 3 Enable different look and feels in SwingSet3 demo test InternalFrameDemoTest client-libs / javax.swing 0
JDK-8210055 3 Enable different look and feel tests in SwingSet3 demo tests client-libs / javax.swing 0
JDK-8210058 4 Algorithmic Italic font leans opposite angle in Printing client-libs / 2d 0
JDK-8210220 3 [AOT] jdwp test cases are failing with error # ERROR: TEST FAILED: Cought IOException while receiving event packet: # ERROR: java.net.SocketTimeoutException: Read timed out hotspot / compiler 0
JDK-8210289 3 ArchivedKlassSubGraphInfoRecord is incomplete hotspot / runtime 0
JDK-8210459 4 Add support for generating compile_commands.json infrastructure / build 0
JDK-8210476 4 sun/security/mscapi/PrngSlow.java fails with Still too slow security-libs / jdk.security 0
JDK-8210512 3 [Testbug] vmTestbase/nsk/jdi/ObjectReference/referringObjects/referringObjects002/referringObjects002.java fails with unexpected size of ClassLoaderReference.referringObjects hotspot / svc 0
JDK-8210523 2 runtime/appcds/cacheObject/DifferentHeapSizes.java crash hotspot / runtime 0
JDK-8210699 4 Problem list tests which times out in Xcomp mode hotspot / compiler 0
JDK-8210632 4 Add key exchange algorithm to javax/net/ssl/TLSCommon/CipherSuite.java security-libs / javax.net.ssl 0
JDK-8210793 4 [JVMCI] AllocateCompileIdTest.java failed to find DiagnosticCommand.class hotspot / compiler 0
JDK-8210910 3 Create test for FileChooserDemo client-libs / javax.swing 0
JDK-8210994 3 Create test for SwingSet3 FrameDemo client-libs / javax.swing 0
JDK-8211139 3 Increase timeout value in all tests under jdk/sanity/client/SwingSet/src client-libs / javax.swing 0
JDK-8211160 3 Handle different look and feels in JInternalFrameOperator client-libs / javax.swing 0
JDK-8211211 3 vmTestbase/metaspace/stressDictionary/StressDictionary.java timeout hotspot / gc 0
JDK-8211322 3 Reduce the timeout of tooltip in SwingSet2DemoTest client-libs / javax.swing 0
JDK-8211443 3 Enable different look and feels in SwingSet3 demo test SplitPaneDemoTest client-libs / javax.swing 0
JDK-8211703 3 JInternalFrame : java.lang.AssertionError: cannot find the internal frame client-libs / javax.swing 0
JDK-8211781 4 re-building fails after changing Graal sources infrastructure / build 0
JDK-8212897 3 Some improvements in the EditorPaneDemotest client-libs / javax.swing 0
JDK-8212903 3 [TestBug] Tests test/jdk/javax/swing/LookAndFeel/8145547/DemandGTK2.sh and DemandGTK3.sh fail on Ubuntu 18.04 LTS client-libs / javax.swing 0
JDK-8213009 4 Refactoring existing SunMSCAPI classes security-libs / javax.crypto 0
JDK-8213010 4 Supporting keys created with certmgr.exe security-libs / javax.crypto 0
JDK-8213168 3 Enable different look and feel tests in SwingSet3 demo test FileChooserDemoTest client-libs / javax.swing 0
JDK-8213348 2 jdk.internal.vm.compiler.management service providers missing in module descriptor hotspot / compiler 0
JDK-8213908 2 AssertionError in DeferredAttr at setOverloadKind tools / javac 0
JDK-8213906 3 Update arm devkits with libXrandr headers infrastructure / build 0
JDK-8214124 4 [TESTBUG] Bugs in runtime/NMT/MallocStressTest.java hotspot / runtime 0
JDK-8214344 3 C2: assert(con.basic_type() != T_ILLEGAL) failed: elembt=byte; loadbt=void; unsigned=0 hotspot / compiler 0
JDK-8214345 4 infinite recursion while checking super class tools / javac 0
JDK-8214471 3 Enable different look and feel tests in SwingSet3 demo test ToolTipDemoTest client-libs / javax.swing 0
JDK-8214534 3 Setting of THIS_FILE in the build is broken infrastructure / build 0
JDK-8214557 4 Filter out VM flags which don't affect AOT code generation hotspot / compiler 0
JDK-8214578 3 [macos] Problem with backslashes on macOS/JIS keyboard: Java ignores system settings client-libs / java.awt 0
JDK-8214840 4 runtime/NMT/MallocStressTest.java timed out hotspot / runtime 0
JDK-8214850 4 Rename vm_operations.?pp files to vmOperations.?pp files hotspot / runtime 0
JDK-8214904 3 Test8004741.java failed due to "Too few ThreadDeath hits; expected at least 6 but saw only 5" hotspot / compiler 0
JDK-8215322 4 add @file support to jaotc hotspot / compiler 0
JDK-8215355 3 Object monitor deadlock with no threads holding the monitor (using jemalloc 5.1) hotspot / runtime 0
JDK-8215396 3 JTabbedPane preferred size calculation is wrong for SCROLL_TAB_LAYOUT client-libs / javax.swing 0
JDK-8216180 3 [AOT] compiler/intrinsics/bigInteger/TestMulAdd.java crashed with AOT enabled hotspot / compiler 0
JDK-8216353 4 Use utility APIs introduced in org/netbeans/jemmy/util/LookAndFeel class in client sanity test cases client-libs / javax.swing 0
JDK-8216354 3 Syntax error in toolchain_windows.m4 infrastructure / build 1
JDK-8216472 3 (se) Stack overflow during selection operation leads to crash (win) core-libs / java.nio 0
JDK-8216535 4 tools/jimage/JImageExtractTest.java timed out tools / jlink 0
JDK-8217235 3 Create automated test for SwingSet ColorChooserDemoTest client-libs / javax.swing 0
JDK-8217297 3 Add support for multiple look and feel for SwingSet SliderDemoTest client-libs / javax.swing 0
JDK-8217338 4 [Containers] Improve systemd slice memory limit support hotspot / runtime 0
JDK-8217613 2 [AOT] TEST_OPTS_AOT_MODULES doesn't work on mac infrastructure / build 0
JDK-8217634 3 RunTest documentation and usability update infrastructure / build 0
JDK-8217717 2 ZGC: Broken oop map in C1 load barrier stub hotspot / gc 0
JDK-8217728 4 Speed up incremental rerun of "make hotspot" infrastructure / build 0
JDK-8218268 3 Javac treats Manifest Class-Path entries as Paths instead of URLs tools / javac 0
JDK-8218662 1 Allow 204 responses with Content-Length:0 core-libs / java.net 10
JDK-8218882 4 NET_Writev is declared, NET_WriteV is defined core-libs / java.net 0
JDK-8218889 3 Improperly use of the Optional API security-libs / javax.net.ssl 10
JDK-8219205 4 JFR file without license header hotspot / jfr 0
JDK-8219723 3 javax/net/ssl/compatibility/Compatibility.java failed on some SNI cases security-libs / javax.net.ssl 0
JDK-8219597 4 (bf) Heap buffer state changes could provoke unexpected exceptions core-libs / java.nio 0
JDK-8220348 4 [ntintel] asserts about copying unaligned array core-libs 0
JDK-8220451 4 jdi/EventQueue/remove/remove004 failed due to "ERROR: thread2 is not alive" core-svc / debugger 0
JDK-8220456 4 jdi/EventQueue/remove_l/remove_l004 failed due to "TIMEOUT while waiting for event" core-svc / debugger 0
JDK-8220479 4 java/nio/channels/Selector/SelectWithConsumer.java failed at testTwoChannels() core-libs / java.nio 0
JDK-8220598 4 Malformed copyright year range in a few files in java.base core-libs 0
JDK-8220613 3 java/util/Arrays/TimSortStackSize2.java times out with fastdebug build core-libs / java.util 0
JDK-8220688 4 [TESTBUG] runtime/NMT/MallocStressTest.java timed out hotspot / runtime 0
JDK-8220786 4 Create new switch to redirect error reporting output to stdout or stderr hotspot / runtime 0
JDK-8221270 3 Duplicated synchronized keywords in SSLSocketImpl security-libs / javax.net.ssl 0
JDK-8221312 4 test/jdk/sanity/client/SwingSet/src/ColorChooserDemoTest.java failed client-libs / javax.swing 0
JDK-8221851 4 Use of THIS_FILE in hotspot invalidates precompiled header on Linux/GCC infrastructure / build 0
JDK-8221885 3 Add intermittent test in the JavaSound to the ProblemList client-libs / javax.sound 0
JDK-8222264 2 Windows incremental build is broken with JDK-8217728 infrastructure / build 0
JDK-8222391 3 javax/net/ssl/compatibility/Compatibility.java should be more flexible security-libs / javax.net.ssl 0
JDK-8222448 3 java/lang/reflect/PublicMethods/PublicMethodsTest.java times out core-libs / java.lang:reflect 0
JDK-8222519 3 ButtonDemoScreenshotTest fails randomly with "still state to be reached" client-libs / javax.swing 0
JDK-8222741 4 jdi/EventQueue/remove/remove004 fails due to VMDisconnectedException core-svc / debugger 0
JDK-8223003 3 SunMSCAPI keys are not cleaned up security-libs / javax.crypto 0
JDK-8223063 4 Support CNG RSA keys security-libs / javax.crypto 0
JDK-8223158 3 Docked MacBook cannot start any Java Swing applications client-libs / javax.swing 0
JDK-8223260 3 NamingManager should cache InitialContextFactory core-libs / javax.naming 10
JDK-8223464 4 Improve version string for Oracle CI builds infrastructure / build 0
JDK-8223558 3 Java does not render Myanmar script correctly client-libs / 2d 0
JDK-8223627 3 jdk-13+20 bundle name contains null instead of ea infrastructure / build 0
JDK-8223638 4 Replace wildcard address with loopback or local host in tests - part 6 core-libs / java.net 0
JDK-8223678 4 Add Visual Studio Code workspace generation support (for native code) infrastructure / build 0
JDK-8223727 4 com/sun/jndi/ldap/privconn/RunTest.java failed due to hang in LdapRequest.getReplyBer core-libs / javax.naming 0
JDK-8223769 4 Assert triggers with -XX:+StressReflectiveCode hotspot / compiler 0
JDK-8223898
/ CVE-2020-2754
2 Forward references to Nashorn Scripting 0
JDK-8223904
/ CVE-2020-2755
2 Improve Nashorn matching Scripting 0
JDK-8224187 4 Refactor arraycopy_prologue to allow ZGC read barriers on arraycopy hotspot / gc 0
JDK-8224475 3 JTextPane does not show images in HTML rendering client-libs / javax.swing 0
JDK-8224541
/ CVE-2020-2756
2 Better mapping of serial ENUMs Serialization 0
JDK-8224549
/ CVE-2020-2757
2 Less Blocking Array Queues Serialization 0
JDK-8224673 3 Adjust permission for delayed starting of debugging core-svc / debugger 0
JDK-8224705 4 Tests that need to be problem-listed or have printer resources client-libs 0
JDK-8224778 4 test/jdk/demo/jfc/J2Ddemo/J2DdemoTest.java cannot find J2Ddemo.jar client-libs / 2d 0
JDK-8224821 4 java/awt/Focus/NoAutotransferToDisabledCompTest/NoAutotransferToDisabledCompTest.java fails linux-x64 client-libs / java.awt 0
JDK-8224830 4 test/jdk/java/awt/Focus/ModalExcludedWindowClickTest/ModalExcludedWindowClickTest.java fails on linux-x64 client-libs / java.awt 0
JDK-8224851 5 AArch64: fix warnings and errors with Clang and GCC 8.3 hotspot 0
JDK-8224905 4 java/lang/ProcessBuilder/Basic.java#id1 failed with stream closed core-libs / java.lang 0
JDK-8225007 4 java/awt/print/PrinterJob/LandscapeStackOverflow.java may hang client-libs / 2d 0
JDK-8225105 4 java/awt/Focus/ShowFrameCheckForegroundTest/ShowFrameCheckForegroundTest.java fails in Windows 10 client-libs / java.awt 0
JDK-8225117 4 java/math/BigInteger/SymmetricRangeTests.java fails with ParseException core-libs / java.math 0
JDK-8225128 4 Add exception for expiring DocuSign root to VerifyCACerts test security-libs / java.security 0
JDK-8225130 4 Add exception for expiring Comodo roots to VerifyCACerts test security-libs / java.security 0
JDK-8225180 2 SignedObject with invalid Key not throwing the InvalidKeyException in Windows security-libs / java.security 0
JDK-8225182 3 JNI exception pending in DestroyXIMCallback of awt_InputMethod.c:1327 client-libs / java.awt:i18n 0
JDK-8225144 3 [macos] In Aqua L&F backspace key does not delete when Shift is pressed client-libs / javax.swing 0
JDK-8225199 4 [Graal] compiler/jvmci/compilerToVM/IsMatureVsReprofileTest.java fails with -XX:CompileThresholdScaling=0.1 hotspot / compiler 0
JDK-8225305 4 ProblemList java/lang/invoke/VarHandles tests hotspot / compiler 0
JDK-8225350 4 compiler/jvmci/compilerToVM/IsCompilableTest.java timed out hotspot / compiler 0
JDK-8225430 4 Replace wildcard address with loopback or local host in tests - part 14 core-libs / java.net 0
JDK-8225435 3 Upgrade IANA Language Subtag Registry to the latest for JDK14 core-libs / java.util:i18n 0
JDK-8225487 4 giflib legal file is missing attribution for openbsd-reallocarray.c. client-libs / java.awt 0
JDK-8225567 4 Wrong file headers with 8202414 fix changeset hotspot / compiler 0
JDK-8225684 4 [AOT] Problem list serviceability/sa tests failed with AOTed java.base hotspot / compiler 0
JDK-8225603 2 Enhancement for big integers core-libs / java.math 0
JDK-8225766 3 Curve in certificate should not affect signature scheme when using TLSv1.3 security-libs / javax.net.ssl 0
JDK-8225797 3 OldObjectSample event creates unexpected amount of checkpoint data hotspot / jfr 0
JDK-8226346 2 Build better binary builders infrastructure / build 0
JDK-8226381 4 ProblemList java/lang/reflect/PublicMethods/PublicMethodsTest.java hotspot / compiler 0
JDK-8226406 3 JVM fails to detect mismatched or corrupt CDS archive hotspot / runtime 0
JDK-8226608 2 Hide the onjcmd option from the help output core-svc / debugger 0
JDK-8226892 3 ActionListeners on JRadioButtons don't get notified when selection is changed with arrow keys client-libs / javax.swing 0
JDK-8227112 4 exclude compiler/intrinsics/sha/sanity tests from AOT runs hotspot / compiler 0
JDK-8227324 3 Upgrade to freetype 2.10.1 client-libs / 2d 0
JDK-8227467 2 Better class method invocations hotspot / runtime 0
JDK-8227528 2 TestAbortVMOnSafepointTimeout.java failed due to "RuntimeException: 'Safepoint sync time longer than' missing from stdout/stderr" hotspot / runtime 0
JDK-8227542 2 Manifest improved jar headers core-svc / java.lang.instrument 0
JDK-8227645 3 Some tests in serviceability/sa run with fixed -Xmx values and risk running out of memory hotspot / svc-agent 0
JDK-8227646 3 [TESTBUG] appcds/SharedArchiveConsistency timed out hotspot / runtime 0
JDK-8227662 2 freetype seeks to index at the end of the font data client-libs / 2d 0
JDK-8228479 4 Correct the format of ColorChooserDemoTest client-libs / javax.swing 0
JDK-8228613 3 java.security.Provider#getServices order is no longer deterministic security-libs / java.security 0
JDK-8228969 2 2019-09-28 public suffix list update security-libs / java.security 0
JDK-8229345 2 Memory leak due to vtable stubs not being shared on SPARC hotspot / runtime 0
JDK-8229236 4 CriticalJNINatives: dll handling should be done in native thread state hotspot / runtime 0
JDK-8229733 2 TLS message handling improvements security-libs / javax.net.ssl 0
JDK-8229888 4 (zipfs) Updating an existing zip file does not preserve original permissions core-libs / java.nio 10
JDK-8229994 3 assert(false) failed: Bad graph detected in get_early_ctrl_for_expensive hotspot / compiler 0
JDK-8230004 4 jdk/internal/jimage/JImageOpenTest.java runs no test tools / jlink 0
JDK-8230235 2 Rendering HTML with empty img attribute and documentBaseKey cause Exception client-libs / javax.swing 10
JDK-8230390 4 Problemlist SA tests with AOT hotspot / compiler 0
JDK-8230400 3 Missing constant pool entry for a method in stacktrace hotspot / jfr 0
JDK-8230459 4 Test failed to resume JVMCI CompilerThread hotspot / compiler 0
JDK-8230480 4 check malloc/calloc results in java.desktop client-libs / java.awt 0
JDK-8230597 2 Update GIFlib library to the 5.2.1 client-libs / java.awt 0
JDK-8230611 3 infinite loop in LogOutputList::wait_until_no_readers() hotspot / svc 0
JDK-8230624 4 [TESTBUG] Problemlist JFR compiler/TestCodeSweeper.java hotspot / jfr 0
JDK-8230677 3 Should disable Escape Analysis if JVMTI capability can_get_owned_monitor_info was taken hotspot / compiler 0
JDK-8230926 3 [macosx] Two apostrophes are entered instead of one with "U.S. International - PC" layout client-libs / java.awt 0
JDK-8231025 2 Incorrect method tag offset for big endian platform hotspot / jfr 0
JDK-8231081 3 TestMetadataRetention fails due to missing symbol id hotspot / jfr 0
JDK-8231387 3 java.security.Provider.getService returns random result due to race condition with mutating methods in the same class security-libs / java.security 0
JDK-8231415
/ CVE-2020-2773
2 Better signatures in XML Security 0
JDK-8231430 3 C2: Memory stomp in max_array_length() for T_ILLEGAL type hotspot / compiler 0
JDK-8231445 3 check ZALLOC return values in awt coding client-libs / java.awt 0
JDK-8231507 3 Update Apache Santuario (XML Signature) to version 2.1.4 security-libs / javax.xml.crypto 0
JDK-8231584 3 Deadlock with ClassLoader.findLibrary and System.loadLibrary call core-libs / java.lang 0
JDK-8231753 4 use more Posix functionality in aix os::print_os_info hotspot / runtime 0
JDK-8231785 2 Improved socket permissions core-libs / java.net 0
JDK-8231810 3 javax/net/ssl/templates/SSLSocketSSLEngineTemplate.java fails intermittently with "java.lang.Exception: Unexpected EOF" security-libs / javax.net.ssl 0
JDK-8232003 4 (fs) Files.write can leak file descriptor in the exception case core-libs / java.nio 0
JDK-8232056 2 GetOwnedMonitorInfoWithEATest.java fails with ZGC: Heap too small hotspot / jvmti 0
JDK-8232060 4 add some initializations using sigemptyset in os_aix.cpp hotspot / runtime 0
JDK-8232167 4 Visual Studio install found through --with-tools-dir value is discarded infrastructure / build 0
JDK-8232170 4 FSInfo#getJarClassPath throws an exception not declared in its throws clause tools 1
JDK-8232200 3 [macos 10.15] Windows in fullscreen tests jumps around the screen client-libs / 2d 0
JDK-8232207 4 Linux os::available_memory re-reads cgroup configuration on every invocation hotspot / runtime 0
JDK-8232224 3 [TESTBUG] problemlist JFR TestLargeRootSet.java hotspot / jfr 0
JDK-8232370 4 Refactor some com.sun.jdi tests to enable IDE integration core-svc / debugger 10
JDK-8232424
/ CVE-2020-2778
2 More constrained algorithms JSSE 0
JDK-8232433 3 [macos 10.15] java/awt/Window/LocationAtScreenCorner/LocationAtScreenCorner.java may fail client-libs / java.awt 0
JDK-8232571 3 new sun.misc.Signal("INFO") throws IllegalArgumentException since JDK11 hotspot / runtime 0
JDK-8232581
/ CVE-2020-2767
2 Improve TLS verification JSSE 0
JDK-8232692 4 [TESTBUG] compiler/aot/fingerprint/SelfChangedCDS.java fails when cds is disabled hotspot / compiler 0
JDK-8232713 4 Update BCEL version to 6.3.1 in license file xml / jaxp 0
JDK-8232806 3 Introduce a system property to disable eager lambda initialization core-libs / java.lang.invoke 0
JDK-8232834 3 RunTest sometimes fails to produce valid exitcode.txt infrastructure / build 0
JDK-8232950 3 SUNPKCS11 Provider incorrectly check key length for PSS Signatures. security-libs / javax.crypto:pkcs11 0
JDK-8232880 3 Update test documentation with additional settings for client UI tooltip tests infrastructure 0
JDK-8233018 4 Add a new test to verify that DatagramSocket is not interruptible core-libs / java.net 0
JDK-8233019 3 java.lang.Class.isPrimitive() (C1) returns wrong result if Klass* is aligned to 32bit hotspot / compiler 0
JDK-8233032 2 assert(in_bb(n)) failed: must be hotspot / compiler 0
JDK-8233078 3 fix minimal VM build on Linux ppc64(le) hotspot / runtime 0
JDK-8233223 3 Add Amazon Root CA certificates security-libs / java.security 0
JDK-8233250 2 Better X11 rendering client-libs / 2d 0
JDK-8233328 3 fix minimal VM build on Linux s390x hotspot 0
JDK-8233383 4 Various minor fixes infrastructure / build 0
JDK-8233410 2 Better Build Scripting infrastructure / build 0
JDK-8233466 4 aarch64: remove unnecessary load of mdo when profiling return and parameters type hotspot / runtime 0
JDK-8233491 4 Crash in AdapterHandlerLibrary::get_adapter with CDS due to code cache exhaustion hotspot / compiler 0
JDK-8233529 2 loopTransform.cpp:2984: Error: assert(p_f->Opcode() == Op_IfFalse) failed hotspot / compiler 0
JDK-8233649 4 Update ProblemList.txt to exclude failing headful tests on macos client-libs 0
JDK-8233548 4 Update CUP to v0.11b xml / jaxp 0
JDK-8233656 3 assert(d->is_CFG() && n->is_CFG()) failed: must have CFG nodes hotspot / compiler 0
JDK-8233657 3 Intermittent NPE in Component.validate() client-libs / java.awt 0
JDK-8233954 2 UnsatisfiedLinkError or NoSuchAlgorithmException after removing sunec.dll security-libs / javax.crypto 0
JDK-8234027 2 Better JCEKS key support security-libs / java.security 0
JDK-8234288 4 Turkey Time Zone returns incorrect time zone name core-libs / java.util:i18n 0
JDK-8234323 3 NULL-check return value of SurfaceData_InitOps on macosx client-libs / 2d 0
JDK-8234339 4 replace JLI_StrTok in java_md_solinux.c tools / launcher 0
JDK-8234340 4 Bump update version for OpenJDK: jdk-11.0.7 infrastructure 0
JDK-8234350 2 assert(mode == ControlAroundStripMined && (use == sfpt || !use->is_reachable_from_root())) failed: missed a node hotspot / compiler 0
JDK-8234386 4 [macos] NPE was thrown at expanding Choice from maximized frame client-libs / javax.swing 0
JDK-8234397 3 add OS uptime information to os::print_os_info output hotspot / runtime 0
JDK-8234408
/ CVE-2020-2781
2 Improve TLS session handling JSSE 0
JDK-8234413
/ CVE-2019-18197
2 Update XSLT processing JavaFX(libxslt) 0
JDK-8234423 3 Modifying ArrayList.subList().subList() resets modCount of subList core-libs / java.util:collections 10
JDK-8234501 4 remove obsolete NET_ReadV core-libs / java.net 0
JDK-8234466 3 Class loading deadlock involving X509Factory#commitEvent() core-libs / java.util.jar 0
JDK-8234525 3 enable link-time section-gc for linux s390x to remove unused code infrastructure / build 0
JDK-8234610 2 MaxVectorSize set wrongly when UseAVX=3 is specified after JDK-8221092 hotspot / compiler 10
JDK-8234617 3 C1: Incorrect result of field load due to missing narrowing conversion hotspot / compiler 0
JDK-8234625 4 hs test serviceability/sa/ClhsdbCDSCore.java fails on macOS 10.15 hotspot / svc 0
JDK-8234645 2 ARM32: C1: PatchingStub for field access: not enough bytes hotspot / compiler 0
JDK-8234723 4 javax/net/ssl/TLS tests support TLSv1.3 security-libs / javax.net.ssl 0
JDK-8234724 4 javax/net/ssl/templates/SSLSocketSSLEngineTemplate.java supports TLSv1.3 security-libs / javax.net.ssl 0
JDK-8234741 4 enhance os::get_core_path on macOS hotspot / runtime 0
JDK-8234769 3 Duplicate attribution in freetype.md client-libs / 2d 0
JDK-8234786 3 Fix for JDK-8214578 breaks OS X 10.12 compatibility client-libs / java.awt 0
JDK-8234809 3 set relro in linker flags when building with gcc infrastructure / build 0
JDK-8234824 3 java/nio/channels/SocketChannel/AdaptSocket.java fails on Windows 10 core-libs / java.nio 0
JDK-8234825
/ CVE-2020-2800
2 Better Headings for HTTP Servers Lightweight HTTP Server 0
JDK-8234841
/ CVE-2020-2803
2 Enhance buffering of byte buffers Libraries 0
JDK-8234906 4 [TESTBUG] TestDivZeroCheckControl fails for client VMs due to Unrecognized VM option LoopUnrollLimit hotspot / compiler 0
JDK-8235142 4 JDK-8193255 backport broke bootstrap with JDK 10 infrastructure / build 0
JDK-8235243 4 handle VS2017 15.9 and VS2019 in abstract_vm_version hotspot / runtime 0
JDK-8235274
/ CVE-2020-2805
2 Enhance typing of methods Libraries 0
JDK-8235288 3 AVX 512 instructions inadvertently used on Xeon for small vector width operations hotspot / compiler 0
JDK-8235325 2 build failure on Linux after 8235243 hotspot / runtime 0
JDK-8235383 4 C1 compilation fails with -XX:+PrintIRDuringConstruction -XX:+Verbose hotspot / compiler 0
JDK-8235403 4 Further cleanup to test serviceability/sa/ClhsdbCDSCore.java hotspot / svc 0
JDK-8235489 3 handle return values of sscanf calls in hotspot hotspot / runtime 0
JDK-8235510 3 java.util.zip.CRC32 performance drop after 8200067 hotspot / compiler 0
JDK-8235563 4 [TESTBUG] appcds/CommandLineFlagComboNegative.java does not handle archive mapping failure hotspot / runtime 0
JDK-8235585 3 Enable macOS codesigning for all libraries and executables infrastructure / build 0
JDK-8235637 3 jhsdb jmap from OpenJDK 11.0.5 doesn't work if prelink is enabled hotspot / svc-agent 0
JDK-8235671 4 enhance print_rlimit_info in os_posix hotspot / runtime 0
JDK-8235687 2 Contents/MacOS/libjli.dylib cannot be a symlink infrastructure / build 0
JDK-8235744 4 PIT: test/jdk/javax/swing/text/html/TestJLabelWithHTMLText.java times out in linux-x64 client-libs / javax.swing 0
JDK-8235691
/ CVE-2020-2816
2 Enhance TLS connectivity JSSE 0
JDK-8235904 4 Infinite loop when rendering huge lines client-libs / 2d 0
JDK-8235998 3 [C2] Memory leaks during tracing after "8224193: stringStream should not use Resource Area". hotspot / compiler 0
JDK-8236039 3 JSSE Client does not accept status_request extension in CertificateRequest messages for TLS 1.3 security-libs / javax.net.ssl 0
JDK-8236140 3 assert(!VerifyHashTableKeys || _hash_lock == 0) failed: remove node from hash table before modifying it hotspot / compiler 0
JDK-8236179 3 C1 register allocation failure with T_ADDRESS hotspot / compiler 0
JDK-8236201
/ CVE-2020-2830
2 Better Scanner conversions Concurrency 0
JDK-8236488 4 Support for configure option --with-native-debug-symbols=internal is impossible on Windows infrastructure / build 0
JDK-8236500 4 Windows ucrt.dll should be looked up in versioned WINSDK subdirectory infrastructure / build 0
JDK-8236709 3 struct SwitchRange in HS violates C++ One Definition Rule hotspot / compiler 0
JDK-8236798 2 Enhance FX scripting support javafx / web 0
JDK-8236848 2 [JDK 11u] make run-test-tier1 fails after backport of JDK-8232834 infrastructure / build 0
JDK-8236873 3 Worker has a deadlock bug tools / jconsole 0
JDK-8237217 4 Incorrect G1StringDedupEntry type used in StringDedupTable destructor hotspot / gc 0
JDK-8237368 2 Problem with NullPointerException in RMI TCPEndpoint.read core-libs / java.rmi 10
JDK-8237375 3 SimpleThresholdPolicy misses CounterDecay timestamp initialization hotspot / compiler 0
JDK-8237508 4 Simplify JarFile.isInitializing core-libs / java.util.jar 11
JDK-8237540 3 Missing files in backport of JDK-8210910 client-libs / javax.swing 0
JDK-8237541 3 Missing files in backport of JDK-8209499 client-libs / javax.swing 0
JDK-8237600 4 Test SunJSSEFIPSInit fails on Ubuntu security-libs / javax.net.ssl 0
JDK-8237819 4 s390x - remove unused pd_zero_to_words_large hotspot / runtime 0
JDK-8237869 4 exclude jtreg test security/infra/java/security/cert/CertPathValidator/certification/LuxTrustCA.java because of instabilities security-libs / java.security 0
JDK-8237879 3 make 4.3 breaks build infrastructure / build 0
JDK-8237945 3 CTW: C2 compilation fails with assert(just_allocated_object(alloc_ctl) == ptr) failed: most recent allo hotspot / compiler 0
JDK-8238225 3 Issues reported after replacing symlink at Contents/MacOS/libjli.dylib with binary infrastructure / build 0
JDK-8238247 4 CTW runner should sweep nmethods more aggressively hotspot / compiler 0
JDK-8238366 4 CTW runner closes standard output on exit hotspot / compiler 0
JDK-8238438 3 SuperWord::co_locate_pack picks memory state of first instead of last load hotspot / compiler 0
JDK-8238534 3 Deep sign macOS bundles before bundle archive is being created infrastructure 10
JDK-8238502 3 sunmscapi.dll causing EXCEPTION_ACCESS_VIOLATION security-libs / javax.crypto 0
JDK-8238591 4 CTW: Split applications/ctw/modules/jdk_localedata.java hotspot / compiler 0
JDK-8238596 2 AVX enabled by default for Skylake even when unsupported hotspot / runtime 0
JDK-8238811 4 C2: assert(i >= req() || i == 0 || is_Region() || is_Phi()) with -XX:+VerifyGraphEdges hotspot / compiler 0
JDK-8238960 2 linux-i586 builds are inconsistent as the newly build jdk is not able to reserve enough space for object heap infrastructure / build 0
JDK-8239005 4 [TESTBUG] test/hotspot/jtreg/runtime/StackGuardPages/TestStackGuardPages.java: exeinvoke.c: must initialize static state before calling do_overflow() hotspot / runtime 0
JDK-8239466 4 Loss of precision in counter decay calculation in 11u backport of JDK-8237375 hotspot / compiler 0
JDK-8239856 4 [ntintel] asserts about copying unaligned array element core-svc / debugger 0
JDK-8239971 2 Enhance SQL queries javafx / web 0
JDK-8240724 4 [test] jdk11 downport of 8224475 misses binary file test/jdk/javax/swing/JTextPane/arrow.png client-libs / javax.swing 0
JDK-8241296 2 Segfault in JNIHandleBlock::oops_do() hotspot / runtime 0

This section organizes the changes in the selected update release by the main component under which each issue is filed.

Core Libs (43)

Issue
Priority
Title
Component
Voting
JDK-7143743 4 (zipfs) Potential memory leak with zip provider core-libs / java.nio 0
JDK-8068184 2 Fix for JDK-8032832 caused a deadlock core-libs / java.net 10
JDK-8193596 4 java/net/DatagramPacket/ReuseBuf.java failed due to timeout core-libs / java.net 0
JDK-8208715 4 Conversion of milliseconds to nanoseconds in UNIXProcess contains bug. core-libs / java.lang 0
JDK-8209824 4 Improve the code coverage for ThreadLocal core-libs / java.lang 0
JDK-8216472 3 (se) Stack overflow during selection operation leads to crash (win) core-libs / java.nio 0
JDK-8218662 1 Allow 204 responses with Content-Length:0 core-libs / java.net 10
JDK-8218882 4 NET_Writev is declared, NET_WriteV is defined core-libs / java.net 0
JDK-8219597 4 (bf) Heap buffer state changes could provoke unexpected exceptions core-libs / java.nio 0
JDK-8220348 4 [ntintel] asserts about copying unaligned array core-libs 0
JDK-8220479 4 java/nio/channels/Selector/SelectWithConsumer.java failed at testTwoChannels() core-libs / java.nio 0
JDK-8220598 4 Malformed copyright year range in a few files in java.base core-libs 0
JDK-8220613 3 java/util/Arrays/TimSortStackSize2.java times out with fastdebug build core-libs / java.util 0
JDK-8222448 3 java/lang/reflect/PublicMethods/PublicMethodsTest.java times out core-libs / java.lang:reflect 0
JDK-8223260 3 NamingManager should cache InitialContextFactory core-libs / javax.naming 10
JDK-8223638 4 Replace wildcard address with loopback or local host in tests - part 6 core-libs / java.net 0
JDK-8223727 4 com/sun/jndi/ldap/privconn/RunTest.java failed due to hang in LdapRequest.getReplyBer core-libs / javax.naming 0
JDK-8223898 2 Forward references to Nashorn core-libs / jdk.nashorn 0
JDK-8223904 2 Improve Nashorn matching core-libs / jdk.nashorn 0
JDK-8224541 2 Better mapping of serial ENUMs core-libs / java.io:serialization 0
JDK-8224549 2 Less Blocking Array Queues core-libs / java.io:serialization 0
JDK-8224905 4 java/lang/ProcessBuilder/Basic.java#id1 failed with stream closed core-libs / java.lang 0
JDK-8225117 4 java/math/BigInteger/SymmetricRangeTests.java fails with ParseException core-libs / java.math 0
JDK-8225430 4 Replace wildcard address with loopback or local host in tests - part 14 core-libs / java.net 0
JDK-8225435 3 Upgrade IANA Language Subtag Registry to the latest for JDK14 core-libs / java.util:i18n 0
JDK-8225603 2 Enhancement for big integers core-libs / java.math 0
JDK-8229888 4 (zipfs) Updating an existing zip file does not preserve original permissions core-libs / java.nio 10
JDK-8231584 3 Deadlock with ClassLoader.findLibrary and System.loadLibrary call core-libs / java.lang 0
JDK-8231785 2 Improved socket permissions core-libs / java.net 0
JDK-8232003 4 (fs) Files.write can leak file descriptor in the exception case core-libs / java.nio 0
JDK-8232806 3 Introduce a system property to disable eager lambda initialization core-libs / java.lang.invoke 0
JDK-8233018 4 Add a new test to verify that DatagramSocket is not interruptible core-libs / java.net 0
JDK-8234288 4 Turkey Time Zone returns incorrect time zone name core-libs / java.util:i18n 0
JDK-8234423 3 Modifying ArrayList.subList().subList() resets modCount of subList core-libs / java.util:collections 10
JDK-8234501 4 remove obsolete NET_ReadV core-libs / java.net 0
JDK-8234466 3 Class loading deadlock involving X509Factory#commitEvent() core-libs / java.util.jar 0
JDK-8234824 3 java/nio/channels/SocketChannel/AdaptSocket.java fails on Windows 10 core-libs / java.nio 0
JDK-8234825 2 Better Headings for HTTP Servers core-libs / java.net 0
JDK-8234841 2 Enhance buffering of byte buffers core-libs / java.nio 0
JDK-8235274 2 Enhance typing of methods core-libs / java.lang.invoke 0
JDK-8236201 2 Better Scanner conversions core-libs / java.util.regex 0
JDK-8237368 2 Problem with NullPointerException in RMI TCPEndpoint.read core-libs / java.rmi 10
JDK-8237508 4 Simplify JarFile.isInitializing core-libs / java.util.jar 11

Security Libs (42)

Issue
Priority
Title
Component
Voting
JDK-4919790 4 Errors in alert ssl message does not reflect the actual certificate status security-libs / javax.net.ssl 0
JDK-7092821 3 java.security.Provider.getService() is synchronized and became scalability bottleneck security-libs / java.security 0
JDK-8005819 4 Support cross-realm MSSFU security-libs / org.ietf.jgss:krb5 0
JDK-8163251 3 Hard coded loop limit prevents reading of smart card data greater than 8k security-libs / javax.smartcardio 0
JDK-8183107 3 PKCS11 regression regarding checkKeySize security-libs / javax.crypto:pkcs11 0
JDK-8201355 4 Avoid native memory allocation in sun.security.mscapi.PRNG.generateSeed security-libs / javax.crypto 0
JDK-8203687 3 javax/net/ssl/compatibility/Compatibility.java supports TLS 1.3 security-libs / javax.net.ssl 0
JDK-8210476 4 sun/security/mscapi/PrngSlow.java fails with Still too slow security-libs / jdk.security 0
JDK-8210632 4 Add key exchange algorithm to javax/net/ssl/TLSCommon/CipherSuite.java security-libs / javax.net.ssl 0
JDK-8213009 4 Refactoring existing SunMSCAPI classes security-libs / javax.crypto 0
JDK-8213010 4 Supporting keys created with certmgr.exe security-libs / javax.crypto 0
JDK-8218889 3 Improperly use of the Optional API security-libs / javax.net.ssl 10
JDK-8219723 3 javax/net/ssl/compatibility/Compatibility.java failed on some SNI cases security-libs / javax.net.ssl 0
JDK-8221270 3 Duplicated synchronized keywords in SSLSocketImpl security-libs / javax.net.ssl 0
JDK-8222391 3 javax/net/ssl/compatibility/Compatibility.java should be more flexible security-libs / javax.net.ssl 0
JDK-8223003 3 SunMSCAPI keys are not cleaned up security-libs / javax.crypto 0
JDK-8223063 4 Support CNG RSA keys security-libs / javax.crypto 0
JDK-8225128 4 Add exception for expiring DocuSign root to VerifyCACerts test security-libs / java.security 0
JDK-8225130 4 Add exception for expiring Comodo roots to VerifyCACerts test security-libs / java.security 0
JDK-8225180 2 SignedObject with invalid Key not throwing the InvalidKeyException in Windows security-libs / java.security 0
JDK-8225766 3 Curve in certificate should not affect signature scheme when using TLSv1.3 security-libs / javax.net.ssl 0
JDK-8228613 3 java.security.Provider#getServices order is no longer deterministic security-libs / java.security 0
JDK-8228969 2 2019-09-28 public suffix list update security-libs / java.security 0
JDK-8229733 2 TLS message handling improvements security-libs / javax.net.ssl 0
JDK-8231387 3 java.security.Provider.getService returns random result due to race condition with mutating methods in the same class security-libs / java.security 0
JDK-8231415 2 Better signatures in XML security-libs / javax.xml.crypto 0
JDK-8231507 3 Update Apache Santuario (XML Signature) to version 2.1.4 security-libs / javax.xml.crypto 0
JDK-8231810 3 javax/net/ssl/templates/SSLSocketSSLEngineTemplate.java fails intermittently with "java.lang.Exception: Unexpected EOF" security-libs / javax.net.ssl 0
JDK-8232424 2 More constrained algorithms security-libs / javax.net.ssl 0
JDK-8232581 2 Improve TLS verification security-libs / javax.net.ssl 0
JDK-8232950 3 SUNPKCS11 Provider incorrectly check key length for PSS Signatures. security-libs / javax.crypto:pkcs11 0
JDK-8233223 3 Add Amazon Root CA certificates security-libs / java.security 0
JDK-8233954 2 UnsatisfiedLinkError or NoSuchAlgorithmException after removing sunec.dll security-libs / javax.crypto 0
JDK-8234027 2 Better JCEKS key support security-libs / java.security 0
JDK-8234408 2 Improve TLS session handling security-libs / javax.net.ssl 0
JDK-8234723 4 javax/net/ssl/TLS tests support TLSv1.3 security-libs / javax.net.ssl 0
JDK-8234724 4 javax/net/ssl/templates/SSLSocketSSLEngineTemplate.java supports TLSv1.3 security-libs / javax.net.ssl 0
JDK-8235691 2 Enhance TLS connectivity security-libs / javax.net.ssl 0
JDK-8236039 3 JSSE Client does not accept status_request extension in CertificateRequest messages for TLS 1.3 security-libs / javax.net.ssl 0
JDK-8237600 4 Test SunJSSEFIPSInit fails on Ubuntu security-libs / javax.net.ssl 0
JDK-8237869 4 exclude jtreg test security/infra/java/security/cert/CertPathValidator/certification/LuxTrustCA.java because of instabilities security-libs / java.security 0
JDK-8238502 3 sunmscapi.dll causing EXCEPTION_ACCESS_VIOLATION security-libs / javax.crypto 0

Hotspot (131)

Issue
Priority
Title
Component
Voting
JDK-8145845 3 [AOT] NullPointerException in compiler/whitebox/GetCodeHeapEntriesTest.java hotspot / compiler 0
JDK-8152988 3 [AOT] Update test batch definitions to include aot-ed java.base module mode into hs-comp testing hotspot / compiler 0
JDK-8167276 5 jvmci/compilerToVM/MaterializeVirtualObjectTest.java fails with -XX:-EliminateAllocations hotspot / compiler 0
JDK-8178798 4 Two compiler/aot/verification/vmflags tests fail by timeout with UseAVX=3 hotspot / compiler 0
JDK-8189633 4 Missing -Xcheck:jni checking for DeleteWeakGlobalRef hotspot / runtime 0
JDK-8193042 4 NativeLookup::lookup_critical_entry() should only load shared library once hotspot / compiler 0
JDK-8196969 3 JTreg Failure: serviceability/sa/ClhsdbJstack.java causes NPE hotspot / svc-agent 0
JDK-8201513 4 nsk/jvmti/IterateThroughHeap/filter-* are broken hotspot / jvmti 0
JDK-8203364 4 Some serviceability/sa/ tests intermittently fail with java.io.IOException: LingeredApp terminated with non-zero exit code 3 hotspot / svc-agent 0
JDK-8203911 4 Test runtime/modules/getModuleJNI/GetModule fails with -Xcheck:jni hotspot / runtime 0
JDK-8204525 3 [TESTBUG] runtime/NMT/MallocStressTest.java ran out of java heap hotspot / runtime 0
JDK-8204529 3 gc/TestAllocateHeapAtMultiple.java fail with Agent 7 timed out hotspot / gc 0
JDK-8204551 4 Event descriptions are truncated in logs hotspot / runtime 0
JDK-8206963 3 [AOT] bug with multiple class loaders hotspot / compiler 0
JDK-8207367 4 10 vmTestbase/nsk/jdi tests timed out when running with jtreg hotspot / svc 0
JDK-8207832 2 serviceability/sa/ClhsdbCDSCore.java failed with java.lang.Error: Couldn't find core file location in: hotspot / runtime 0
JDK-8208157 3 requires.VMProps throws NPE for missing properties in "release" file hotspot / test 0
JDK-8208379 3 compiler/jvmci/events/JvmciNotifyInstallEventTest.java failed with "Got unexpected event count after 2nd install attempt: expected 9 to equal 2" hotspot / compiler 0
JDK-8208658 3 Make CDS archived heap regions usable even if compressed oop encoding has changed hotspot / runtime 0
JDK-8209361 3 [AOT] Unexpected number of references for JVMTI_HEAP_REFERENCE_CONSTANT_POOL [111-->111]: 0 (expected at least 1) hotspot / jvmti 0
JDK-8209385 3 CDS runtime classpath checking is too strict when only classes from the system modules are archived hotspot / runtime 0
JDK-8209389 3 SIGSEGV in WalkOopAndArchiveClosure::do_oop_work hotspot / runtime 0
JDK-8209574 3 [AOT] breakpoint events are generated in different threads does not meet expected count when testcase vm/jvmti/Breakpoint/brkp001/brkp00102/brkp00102.html is executed hotspot / compiler 0
JDK-8209657 3 Refactor filemap.hpp to simplify integration with Serviceability Agent hotspot / runtime 0
JDK-8209686 4 cleanup arguments to PhaseIdealLoop() constructor hotspot / compiler 0
JDK-8209802 4 Garbage collectors should register JFR types themselves to avoid build errors. hotspot / gc 0
JDK-8209807 4 improve handling exception in requires.VMProps hotspot / test 0
JDK-8209826 3 Undefined reference to os::write after JDK-8209657 (filemap.hpp cleanup) hotspot / runtime 0
JDK-8209850 4 Allow NamedThreads to use GlobalCounter critical sections hotspot / runtime 0
JDK-8209976 4 Improve iteration over non-JavaThreads hotspot / runtime 0
JDK-8210024 4 JFR calls virtual is_Java_thread from ~Thread() hotspot / jfr 0
JDK-8210220 3 [AOT] jdwp test cases are failing with error # ERROR: TEST FAILED: Cought IOException while receiving event packet: # ERROR: java.net.SocketTimeoutException: Read timed out hotspot / compiler 0
JDK-8210289 3 ArchivedKlassSubGraphInfoRecord is incomplete hotspot / runtime 0
JDK-8210512 3 [Testbug] vmTestbase/nsk/jdi/ObjectReference/referringObjects/referringObjects002/referringObjects002.java fails with unexpected size of ClassLoaderReference.referringObjects hotspot / svc 0
JDK-8210523 2 runtime/appcds/cacheObject/DifferentHeapSizes.java crash hotspot / runtime 0
JDK-8210699 4 Problem list tests which times out in Xcomp mode hotspot / compiler 0
JDK-8210793 4 [JVMCI] AllocateCompileIdTest.java failed to find DiagnosticCommand.class hotspot / compiler 0
JDK-8211211 3 vmTestbase/metaspace/stressDictionary/StressDictionary.java timeout hotspot / gc 0
JDK-8213348 2 jdk.internal.vm.compiler.management service providers missing in module descriptor hotspot / compiler 0
JDK-8214124 4 [TESTBUG] Bugs in runtime/NMT/MallocStressTest.java hotspot / runtime 0
JDK-8214344 3 C2: assert(con.basic_type() != T_ILLEGAL) failed: elembt=byte; loadbt=void; unsigned=0 hotspot / compiler 0
JDK-8214557 4 Filter out VM flags which don't affect AOT code generation hotspot / compiler 0
JDK-8214840 4 runtime/NMT/MallocStressTest.java timed out hotspot / runtime 0
JDK-8214850 4 Rename vm_operations.?pp files to vmOperations.?pp files hotspot / runtime 0
JDK-8214904 3 Test8004741.java failed due to "Too few ThreadDeath hits; expected at least 6 but saw only 5" hotspot / compiler 0
JDK-8215322 4 add @file support to jaotc hotspot / compiler 0
JDK-8215355 3 Object monitor deadlock with no threads holding the monitor (using jemalloc 5.1) hotspot / runtime 0
JDK-8216180 3 [AOT] compiler/intrinsics/bigInteger/TestMulAdd.java crashed with AOT enabled hotspot / compiler 0
JDK-8217338 4 [Containers] Improve systemd slice memory limit support hotspot / runtime 0
JDK-8217717 2 ZGC: Broken oop map in C1 load barrier stub hotspot / gc 0
JDK-8219205 4 JFR file without license header hotspot / jfr 0
JDK-8220688 4 [TESTBUG] runtime/NMT/MallocStressTest.java timed out hotspot / runtime 0
JDK-8220786 4 Create new switch to redirect error reporting output to stdout or stderr hotspot / runtime 0
JDK-8223769 4 Assert triggers with -XX:+StressReflectiveCode hotspot / compiler 0
JDK-8224187 4 Refactor arraycopy_prologue to allow ZGC read barriers on arraycopy hotspot / gc 0
JDK-8224851 5 AArch64: fix warnings and errors with Clang and GCC 8.3 hotspot 0
JDK-8225199 4 [Graal] compiler/jvmci/compilerToVM/IsMatureVsReprofileTest.java fails with -XX:CompileThresholdScaling=0.1 hotspot / compiler 0
JDK-8225305 4 ProblemList java/lang/invoke/VarHandles tests hotspot / compiler 0
JDK-8225350 4 compiler/jvmci/compilerToVM/IsCompilableTest.java timed out hotspot / compiler 0
JDK-8225567 4 Wrong file headers with 8202414 fix changeset hotspot / compiler 0
JDK-8225684 4 [AOT] Problem list serviceability/sa tests failed with AOTed java.base hotspot / compiler 0
JDK-8225797 3 OldObjectSample event creates unexpected amount of checkpoint data hotspot / jfr 0
JDK-8226381 4 ProblemList java/lang/reflect/PublicMethods/PublicMethodsTest.java hotspot / compiler 0
JDK-8226406 3 JVM fails to detect mismatched or corrupt CDS archive hotspot / runtime 0
JDK-8227112 4 exclude compiler/intrinsics/sha/sanity tests from AOT runs hotspot / compiler 0
JDK-8227467 2 Better class method invocations hotspot / runtime 0
JDK-8227528 2 TestAbortVMOnSafepointTimeout.java failed due to "RuntimeException: 'Safepoint sync time longer than' missing from stdout/stderr" hotspot / runtime 0
JDK-8227645 3 Some tests in serviceability/sa run with fixed -Xmx values and risk running out of memory hotspot / svc-agent 0
JDK-8227646 3 [TESTBUG] appcds/SharedArchiveConsistency timed out hotspot / runtime 0
JDK-8229345 2 Memory leak due to vtable stubs not being shared on SPARC hotspot / runtime 0
JDK-8229236 4 CriticalJNINatives: dll handling should be done in native thread state hotspot / runtime 0
JDK-8229994 3 assert(false) failed: Bad graph detected in get_early_ctrl_for_expensive hotspot / compiler 0
JDK-8230390 4 Problemlist SA tests with AOT hotspot / compiler 0
JDK-8230400 3 Missing constant pool entry for a method in stacktrace hotspot / jfr 0
JDK-8230459 4 Test failed to resume JVMCI CompilerThread hotspot / compiler 0
JDK-8230611 3 infinite loop in LogOutputList::wait_until_no_readers() hotspot / svc 0
JDK-8230624 4 [TESTBUG] Problemlist JFR compiler/TestCodeSweeper.java hotspot / jfr 0
JDK-8230677 3 Should disable Escape Analysis if JVMTI capability can_get_owned_monitor_info was taken hotspot / compiler 0
JDK-8231025 2 Incorrect method tag offset for big endian platform hotspot / jfr 0
JDK-8231081 3 TestMetadataRetention fails due to missing symbol id hotspot / jfr 0
JDK-8231430 3 C2: Memory stomp in max_array_length() for T_ILLEGAL type hotspot / compiler 0
JDK-8231753 4 use more Posix functionality in aix os::print_os_info hotspot / runtime 0
JDK-8232056 2 GetOwnedMonitorInfoWithEATest.java fails with ZGC: Heap too small hotspot / jvmti 0
JDK-8232060 4 add some initializations using sigemptyset in os_aix.cpp hotspot / runtime 0
JDK-8232207 4 Linux os::available_memory re-reads cgroup configuration on every invocation hotspot / runtime 0
JDK-8232224 3 [TESTBUG] problemlist JFR TestLargeRootSet.java hotspot / jfr 0
JDK-8232571 3 new sun.misc.Signal("INFO") throws IllegalArgumentException since JDK11 hotspot / runtime 0
JDK-8232692 4 [TESTBUG] compiler/aot/fingerprint/SelfChangedCDS.java fails when cds is disabled hotspot / compiler 0
JDK-8233019 3 java.lang.Class.isPrimitive() (C1) returns wrong result if Klass* is aligned to 32bit hotspot / compiler 0
JDK-8233032 2 assert(in_bb(n)) failed: must be hotspot / compiler 0
JDK-8233078 3 fix minimal VM build on Linux ppc64(le) hotspot / runtime 0
JDK-8233328 3 fix minimal VM build on Linux s390x hotspot 0
JDK-8233466 4 aarch64: remove unnecessary load of mdo when profiling return and parameters type hotspot / runtime 0
JDK-8233491 4 Crash in AdapterHandlerLibrary::get_adapter with CDS due to code cache exhaustion hotspot / compiler 0
JDK-8233529 2 loopTransform.cpp:2984: Error: assert(p_f->Opcode() == Op_IfFalse) failed hotspot / compiler 0
JDK-8233656 3 assert(d->is_CFG() && n->is_CFG()) failed: must have CFG nodes hotspot / compiler 0
JDK-8234350 2 assert(mode == ControlAroundStripMined && (use == sfpt || !use->is_reachable_from_root())) failed: missed a node hotspot / compiler 0
JDK-8234397 3 add OS uptime information to os::print_os_info output hotspot / runtime 0
JDK-8234610 2 MaxVectorSize set wrongly when UseAVX=3 is specified after JDK-8221092 hotspot / compiler 10
JDK-8234617 3 C1: Incorrect result of field load due to missing narrowing conversion hotspot / compiler 0
JDK-8234625 4 hs test serviceability/sa/ClhsdbCDSCore.java fails on macOS 10.15 hotspot / svc 0
JDK-8234645 2 ARM32: C1: PatchingStub for field access: not enough bytes hotspot / compiler 0
JDK-8234741 4 enhance os::get_core_path on macOS hotspot / runtime 0
JDK-8234906 4 [TESTBUG] TestDivZeroCheckControl fails for client VMs due to Unrecognized VM option LoopUnrollLimit hotspot / compiler 0
JDK-8235243 4 handle VS2017 15.9 and VS2019 in abstract_vm_version hotspot / runtime 0
JDK-8235288 3 AVX 512 instructions inadvertently used on Xeon for small vector width operations hotspot / compiler 0
JDK-8235325 2 build failure on Linux after 8235243 hotspot / runtime 0
JDK-8235383 4 C1 compilation fails with -XX:+PrintIRDuringConstruction -XX:+Verbose hotspot / compiler 0
JDK-8235403 4 Further cleanup to test serviceability/sa/ClhsdbCDSCore.java hotspot / svc 0
JDK-8235489 3 handle return values of sscanf calls in hotspot hotspot / runtime 0
JDK-8235510 3 java.util.zip.CRC32 performance drop after 8200067 hotspot / compiler 0
JDK-8235563 4 [TESTBUG] appcds/CommandLineFlagComboNegative.java does not handle archive mapping failure hotspot / runtime 0
JDK-8235637 3 jhsdb jmap from OpenJDK 11.0.5 doesn't work if prelink is enabled hotspot / svc-agent 0
JDK-8235671 4 enhance print_rlimit_info in os_posix hotspot / runtime 0
JDK-8235998 3 [C2] Memory leaks during tracing after "8224193: stringStream should not use Resource Area". hotspot / compiler 0
JDK-8236140 3 assert(!VerifyHashTableKeys || _hash_lock == 0) failed: remove node from hash table before modifying it hotspot / compiler 0
JDK-8236179 3 C1 register allocation failure with T_ADDRESS hotspot / compiler 0
JDK-8236709 3 struct SwitchRange in HS violates C++ One Definition Rule hotspot / compiler 0
JDK-8237217 4 Incorrect G1StringDedupEntry type used in StringDedupTable destructor hotspot / gc 0
JDK-8237375 3 SimpleThresholdPolicy misses CounterDecay timestamp initialization hotspot / compiler 0
JDK-8237819 4 s390x - remove unused pd_zero_to_words_large hotspot / runtime 0
JDK-8237945 3 CTW: C2 compilation fails with assert(just_allocated_object(alloc_ctl) == ptr) failed: most recent allo hotspot / compiler 0
JDK-8238247 4 CTW runner should sweep nmethods more aggressively hotspot / compiler 0
JDK-8238366 4 CTW runner closes standard output on exit hotspot / compiler 0
JDK-8238438 3 SuperWord::co_locate_pack picks memory state of first instead of last load hotspot / compiler 0
JDK-8238591 4 CTW: Split applications/ctw/modules/jdk_localedata.java hotspot / compiler 0
JDK-8238596 2 AVX enabled by default for Skylake even when unsupported hotspot / runtime 0
JDK-8238811 4 C2: assert(i >= req() || i == 0 || is_Region() || is_Phi()) with -XX:+VerifyGraphEdges hotspot / compiler 0
JDK-8239005 4 [TESTBUG] test/hotspot/jtreg/runtime/StackGuardPages/TestStackGuardPages.java: exeinvoke.c: must initialize static state before calling do_overflow() hotspot / runtime 0
JDK-8239466 4 Loss of precision in counter decay calculation in 11u backport of JDK-8237375 hotspot / compiler 0
JDK-8241296 2 Segfault in JNIHandleBlock::oops_do() hotspot / runtime 0

Client Libs (73)

Issue
Priority
Title
Component
Voting
JDK-4949105 3 Access Bridge lacks html tags parsing client-libs / javax.accessibility 0
JDK-8042383 4 [TEST_BUG] Test javax/swing/plaf/basic/BasicMenuUI/4983388/bug4983388.java fails with shortcuts on menus do not work client-libs / javax.swing 0
JDK-8176556 4 java/awt/dnd/ImageTransferTest/ImageTransferTest.java fails for JFIF client-libs / java.awt 0
JDK-8194944 4 Regression automated test 'open/test/jdk/javax/swing/JInternalFrame/8145896/TestJInternalFrameMaximize.java' fails client-libs / javax.swing 0
JDK-8196467 4 javax/swing/JInternalFrame/Test6325652.java fails client-libs / javax.swing 0
JDK-8198321 4 javax/swing/JEditorPane/5076514/bug5076514.java fails client-libs / javax.swing 0
JDK-8198398 4 Test javax/swing/JColorChooser/Test6199676.java fails in mach5 client-libs / javax.swing 0
JDK-8199072 4 Test javax/swing/GroupLayout/6613904/bug6613904.java is unstable client-libs / javax.swing 0
JDK-8203904 4 javax/swing/JSplitPane/4816114/bug4816114.java: The divider location is wrong client-libs / javax.swing 0
JDK-8207938 3 At step6,Click Add button,case failed automatically. client-libs / java.awt 0
JDK-8209418 3 Synchronize test/jdk/sanity/client/lib/jemmy with code-tools/jemmy/v2 client-libs / javax.swing 0
JDK-8209494 3 Create a test for SwingSet3 InternalFrameDemo client-libs / javax.swing 0
JDK-8209499 3 Create test for SwingSet3 EditorPaneDemo client-libs / javax.swing 0
JDK-8209789 3 Synchronize test/jdk/sanity/client/lib/jemmy with code-tools/jemmy/v2 client-libs / javax.swing 0
JDK-8209993 3 Create a test for SwingSet3 ToolTipDemo client-libs / javax.swing 0
JDK-8210052 3 Enable testing for all the available look and feels in SwingSet3 demo tests client-libs / javax.swing 0
JDK-8210057 3 Enable different look and feels in SwingSet3 demo test InternalFrameDemoTest client-libs / javax.swing 0
JDK-8210055 3 Enable different look and feel tests in SwingSet3 demo tests client-libs / javax.swing 0
JDK-8210058 4 Algorithmic Italic font leans opposite angle in Printing client-libs / 2d 0
JDK-8210910 3 Create test for FileChooserDemo client-libs / javax.swing 0
JDK-8210994 3 Create test for SwingSet3 FrameDemo client-libs / javax.swing 0
JDK-8211139 3 Increase timeout value in all tests under jdk/sanity/client/SwingSet/src client-libs / javax.swing 0
JDK-8211160 3 Handle different look and feels in JInternalFrameOperator client-libs / javax.swing 0
JDK-8211322 3 Reduce the timeout of tooltip in SwingSet2DemoTest client-libs / javax.swing 0
JDK-8211443 3 Enable different look and feels in SwingSet3 demo test SplitPaneDemoTest client-libs / javax.swing 0
JDK-8211703 3 JInternalFrame : java.lang.AssertionError: cannot find the internal frame client-libs / javax.swing 0
JDK-8212897 3 Some improvements in the EditorPaneDemotest client-libs / javax.swing 0
JDK-8212903 3 [TestBug] Tests test/jdk/javax/swing/LookAndFeel/8145547/DemandGTK2.sh and DemandGTK3.sh fail on Ubuntu 18.04 LTS client-libs / javax.swing 0
JDK-8213168 3 Enable different look and feel tests in SwingSet3 demo test FileChooserDemoTest client-libs / javax.swing 0
JDK-8214471 3 Enable different look and feel tests in SwingSet3 demo test ToolTipDemoTest client-libs / javax.swing 0
JDK-8214578 3 [macos] Problem with backslashes on macOS/JIS keyboard: Java ignores system settings client-libs / java.awt 0
JDK-8215396 3 JTabbedPane preferred size calculation is wrong for SCROLL_TAB_LAYOUT client-libs / javax.swing 0
JDK-8216353 4 Use utility APIs introduced in org/netbeans/jemmy/util/LookAndFeel class in client sanity test cases client-libs / javax.swing 0
JDK-8217235 3 Create automated test for SwingSet ColorChooserDemoTest client-libs / javax.swing 0
JDK-8217297 3 Add support for multiple look and feel for SwingSet SliderDemoTest client-libs / javax.swing 0
JDK-8221312 4 test/jdk/sanity/client/SwingSet/src/ColorChooserDemoTest.java failed client-libs / javax.swing 0
JDK-8221885 3 Add intermittent test in the JavaSound to the ProblemList client-libs / javax.sound 0
JDK-8222519 3 ButtonDemoScreenshotTest fails randomly with "still state to be reached" client-libs / javax.swing 0
JDK-8223158 3 Docked MacBook cannot start any Java Swing applications client-libs / javax.swing 0
JDK-8223558 3 Java does not render Myanmar script correctly client-libs / 2d 0
JDK-8224475 3 JTextPane does not show images in HTML rendering client-libs / javax.swing 0
JDK-8224705 4 Tests that need to be problem-listed or have printer resources client-libs 0
JDK-8224778 4 test/jdk/demo/jfc/J2Ddemo/J2DdemoTest.java cannot find J2Ddemo.jar client-libs / 2d 0
JDK-8224821 4 java/awt/Focus/NoAutotransferToDisabledCompTest/NoAutotransferToDisabledCompTest.java fails linux-x64 client-libs / java.awt 0
JDK-8224830 4 test/jdk/java/awt/Focus/ModalExcludedWindowClickTest/ModalExcludedWindowClickTest.java fails on linux-x64 client-libs / java.awt 0
JDK-8225007 4 java/awt/print/PrinterJob/LandscapeStackOverflow.java may hang client-libs / 2d 0
JDK-8225105 4 java/awt/Focus/ShowFrameCheckForegroundTest/ShowFrameCheckForegroundTest.java fails in Windows 10 client-libs / java.awt 0
JDK-8225182 3 JNI exception pending in DestroyXIMCallback of awt_InputMethod.c:1327 client-libs / java.awt:i18n 0
JDK-8225144 3 [macos] In Aqua L&F backspace key does not delete when Shift is pressed client-libs / javax.swing 0
JDK-8225487 4 giflib legal file is missing attribution for openbsd-reallocarray.c. client-libs / java.awt 0
JDK-8226892 3 ActionListeners on JRadioButtons don't get notified when selection is changed with arrow keys client-libs / javax.swing 0
JDK-8227324 3 Upgrade to freetype 2.10.1 client-libs / 2d 0
JDK-8227662 2 freetype seeks to index at the end of the font data client-libs / 2d 0
JDK-8228479 4 Correct the format of ColorChooserDemoTest client-libs / javax.swing 0
JDK-8230235 2 Rendering HTML with empty img attribute and documentBaseKey cause Exception client-libs / javax.swing 10
JDK-8230480 4 check malloc/calloc results in java.desktop client-libs / java.awt 0
JDK-8230597 2 Update GIFlib library to the 5.2.1 client-libs / java.awt 0
JDK-8230926 3 [macosx] Two apostrophes are entered instead of one with "U.S. International - PC" layout client-libs / java.awt 0
JDK-8231445 3 check ZALLOC return values in awt coding client-libs / java.awt 0
JDK-8232200 3 [macos 10.15] Windows in fullscreen tests jumps around the screen client-libs / 2d 0
JDK-8232433 3 [macos 10.15] java/awt/Window/LocationAtScreenCorner/LocationAtScreenCorner.java may fail client-libs / java.awt 0
JDK-8233250 2 Better X11 rendering client-libs / 2d 0
JDK-8233649 4 Update ProblemList.txt to exclude failing headful tests on macos client-libs 0
JDK-8233657 3 Intermittent NPE in Component.validate() client-libs / java.awt 0
JDK-8234323 3 NULL-check return value of SurfaceData_InitOps on macosx client-libs / 2d 0
JDK-8234386 4 [macos] NPE was thrown at expanding Choice from maximized frame client-libs / javax.swing 0
JDK-8234769 3 Duplicate attribution in freetype.md client-libs / 2d 0
JDK-8234786 3 Fix for JDK-8214578 breaks OS X 10.12 compatibility client-libs / java.awt 0
JDK-8235744 4 PIT: test/jdk/javax/swing/text/html/TestJLabelWithHTMLText.java times out in linux-x64 client-libs / javax.swing 0
JDK-8235904 4 Infinite loop when rendering huge lines client-libs / 2d 0
JDK-8237540 3 Missing files in backport of JDK-8210910 client-libs / javax.swing 0
JDK-8237541 3 Missing files in backport of JDK-8209499 client-libs / javax.swing 0
JDK-8240724 4 [test] jdk11 downport of 8224475 misses binary file test/jdk/javax/swing/JTextPane/arrow.png client-libs / javax.swing 0

Other (61)

Issue
Priority
Title
Component
Voting
JDK-8160926 3 FLAGS_COMPILER_CHECK_ARGUMENTS doesn't handle cross-compilation infrastructure / build 0
JDK-8163083 3 SocketListeningConnector does not allow invocations with port 0 core-svc / debugger 0
JDK-8169718 3 nsk/jdb/locals/locals002: ERROR: Cannot find boolVar with expected value: false core-svc / debugger 0
JDK-8185005 4 Improve performance of ThreadMXBean.getThreadInfo(long ids[], int maxDepth) core-svc / java.lang.management 0
JDK-8189861 4 Refactor CacheFind infrastructure / build 0
JDK-8200432 3 javadoc fails with ClassCastException on {@link byte[]} tools / javadoc(tool) 0
JDK-8201349 4 build broken when configured with --with-zlib=bundled on gcc 7.3 infrastructure / build 0
JDK-8209817 3 stack is executable when building with Clang on Linux infrastructure / build 0
JDK-8210459 4 Add support for generating compile_commands.json infrastructure / build 0
JDK-8211781 4 re-building fails after changing Graal sources infrastructure / build 0
JDK-8213908 2 AssertionError in DeferredAttr at setOverloadKind tools / javac 0
JDK-8213906 3 Update arm devkits with libXrandr headers infrastructure / build 0
JDK-8214345 4 infinite recursion while checking super class tools / javac 0
JDK-8214534 3 Setting of THIS_FILE in the build is broken infrastructure / build 0
JDK-8216354 3 Syntax error in toolchain_windows.m4 infrastructure / build 1
JDK-8216535 4 tools/jimage/JImageExtractTest.java timed out tools / jlink 0
JDK-8217613 2 [AOT] TEST_OPTS_AOT_MODULES doesn't work on mac infrastructure / build 0
JDK-8217634 3 RunTest documentation and usability update infrastructure / build 0
JDK-8217728 4 Speed up incremental rerun of "make hotspot" infrastructure / build 0
JDK-8218268 3 Javac treats Manifest Class-Path entries as Paths instead of URLs tools / javac 0
JDK-8220451 4 jdi/EventQueue/remove/remove004 failed due to "ERROR: thread2 is not alive" core-svc / debugger 0
JDK-8220456 4 jdi/EventQueue/remove_l/remove_l004 failed due to "TIMEOUT while waiting for event" core-svc / debugger 0
JDK-8221851 4 Use of THIS_FILE in hotspot invalidates precompiled header on Linux/GCC infrastructure / build 0
JDK-8222264 2 Windows incremental build is broken with JDK-8217728 infrastructure / build 0
JDK-8222741 4 jdi/EventQueue/remove/remove004 fails due to VMDisconnectedException core-svc / debugger 0
JDK-8223464 4 Improve version string for Oracle CI builds infrastructure / build 0
JDK-8223627 3 jdk-13+20 bundle name contains null instead of ea infrastructure / build 0
JDK-8223678 4 Add Visual Studio Code workspace generation support (for native code) infrastructure / build 0
JDK-8224673 3 Adjust permission for delayed starting of debugging core-svc / debugger 0
JDK-8226346 2 Build better binary builders infrastructure / build 0
JDK-8226608 2 Hide the onjcmd option from the help output core-svc / debugger 0
JDK-8227542 2 Manifest improved jar headers core-svc / java.lang.instrument 0
JDK-8230004 4 jdk/internal/jimage/JImageOpenTest.java runs no test tools / jlink 0
JDK-8232167 4 Visual Studio install found through --with-tools-dir value is discarded infrastructure / build 0
JDK-8232170 4 FSInfo#getJarClassPath throws an exception not declared in its throws clause tools 1
JDK-8232370 4 Refactor some com.sun.jdi tests to enable IDE integration core-svc / debugger 10
JDK-8232713 4 Update BCEL version to 6.3.1 in license file xml / jaxp 0
JDK-8232834 3 RunTest sometimes fails to produce valid exitcode.txt infrastructure / build 0
JDK-8232880 3 Update test documentation with additional settings for client UI tooltip tests infrastructure 0
JDK-8233383 4 Various minor fixes infrastructure / build 0
JDK-8233410 2 Better Build Scripting infrastructure / build 0
JDK-8233548 4 Update CUP to v0.11b xml / jaxp 0
JDK-8234339 4 replace JLI_StrTok in java_md_solinux.c tools / launcher 0
JDK-8234340 4 Bump update version for OpenJDK: jdk-11.0.7 infrastructure 0
JDK-8234413 2 Update XSLT processing javafx / web 0
JDK-8234525 3 enable link-time section-gc for linux s390x to remove unused code infrastructure / build 0
JDK-8234809 3 set relro in linker flags when building with gcc infrastructure / build 0
JDK-8235142 4 JDK-8193255 backport broke bootstrap with JDK 10 infrastructure / build 0
JDK-8235585 3 Enable macOS codesigning for all libraries and executables infrastructure / build 0
JDK-8235687 2 Contents/MacOS/libjli.dylib cannot be a symlink infrastructure / build 0
JDK-8236488 4 Support for configure option --with-native-debug-symbols=internal is impossible on Windows infrastructure / build 0
JDK-8236500 4 Windows ucrt.dll should be looked up in versioned WINSDK subdirectory infrastructure / build 0
JDK-8236798 2 Enhance FX scripting support javafx / web 0
JDK-8236848 2 [JDK 11u] make run-test-tier1 fails after backport of JDK-8232834 infrastructure / build 0
JDK-8236873 3 Worker has a deadlock bug tools / jconsole 0
JDK-8237879 3 make 4.3 breaks build infrastructure / build 0
JDK-8238225 3 Issues reported after replacing symlink at Contents/MacOS/libjli.dylib with binary infrastructure / build 0
JDK-8238534 3 Deep sign macOS bundles before bundle archive is being created infrastructure 10
JDK-8238960 2 linux-i586 builds are inconsistent as the newly build jdk is not able to reserve enough space for object heap infrastructure / build 0
JDK-8239856 4 [ntintel] asserts about copying unaligned array element core-svc / debugger 0
JDK-8239971 2 Enhance SQL queries javafx / web 0

This section summarizes JDK Common Vulnerabilities and Exposure (CVE) fixes in the selected update release.

CVE Fixes (14)

CVE
Component
Protocol
CVSS Version 3.0 Risk (see Risk Matrix Definitions)
Base Score
Attack Vector
Attack Complex
Privs Req'd
User Interact
Scope
Confidentiality
Integrity
Availability
Notes
CVE-2020-2803
/ JDK-8234841
Libraries Multiple 8.3 Network High None Required Changed High High High Note 1 *
CVE-2020-2805
/ JDK-8235274
Libraries Multiple 8.3 Network High None Required Changed High High High Note 1 *
CVE-2019-18197
/ JDK-8234413
JavaFX(libxslt) Multiple 8.1 Network High None None Unchanged High High High Note 1 *
CVE-2020-2816
/ JDK-8235691
JSSE HTTPS 7.5 Network Low None None Unchanged None High None Note 2 *
CVE-2020-2781
/ JDK-8234408
JSSE HTTPS 5.3 Network Low None None Unchanged None None Low Note 3 *
CVE-2020-2830
/ JDK-8236201
Concurrency Multiple 5.3 Network Low None None Unchanged None None Low Note 3 *
CVE-2020-2767
/ JDK-8232581
JSSE HTTPS 4.8 Network High None None Unchanged Low Low None Note 3 *
CVE-2020-2800
/ JDK-8234825
Lightweight HTTP Server Multiple 4.8 Network High None None Unchanged Low Low None Note 2 *
CVE-2020-2778
/ JDK-8232424
JSSE HTTPS 3.7 Network High None None Unchanged Low None None Note 3 *
CVE-2020-2773
/ JDK-8231415
Security Multiple 3.7 Network High None None Unchanged None None Low Note 3 *
CVE-2020-2757
/ JDK-8224549
Serialization Multiple 3.7 Network High None None Unchanged None None Low Note 3 *
CVE-2020-2755
/ JDK-8223904
Scripting Multiple 3.7 Network High None None Unchanged None None Low Note 3 *
CVE-2020-2754
/ JDK-8223898
Scripting Multiple 3.7 Network High None None Unchanged None None Low Note 3 *
CVE-2020-2756
/ JDK-8224541
Serialization Multiple 3.7 Network High None None Unchanged None None Low Note 3 *

Notes:

ID Notes
1 This vulnerability applies to Java deployments that load and run untrusted code (e.g., code that comes from the internet) and rely on the Java sandbox for security. This vulnerability does not apply to Java deployments, typically in servers, that load and run only trusted code (e.g., code installed by an administrator).
2 This vulnerability can only be exploited by supplying data to APIs in the specified Component without using untrusted code executed under Java sandbox restrictions, such as through a web service.
3 This vulnerability applies to client and server deployment of Java. This vulnerability can be exploited through untrusted code executed under Java sandbox restrictions. It can also be exploited by supplying data to APIs in the specified Component without using untrusted code executed under Java sandbox restrictions, such as through a web service.
  • ID: 1

    Notes: This vulnerability applies to Java deployments that load and run untrusted code (e.g., code that comes from the internet) and rely on the Java sandbox for security. This vulnerability does not apply to Java deployments, typically in servers, that load and run only trusted code (e.g., code installed by an administrator).

  • ID: 2

    Notes: This vulnerability can only be exploited by supplying data to APIs in the specified Component without using untrusted code executed under Java sandbox restrictions, such as through a web service.

  • ID: 3

    Notes: This vulnerability applies to client and server deployment of Java. This vulnerability can be exploited through untrusted code executed under Java sandbox restrictions. It can also be exploited by supplying data to APIs in the specified Component without using untrusted code executed under Java sandbox restrictions, such as through a web service.

Security-Related Non-CVE (12)

Issue
Priority
Title
Component
JDK-8225603 2 Enhancement for big integers core-libs / java.math
JDK-8226346 2 Build better binary builders infrastructure / build
JDK-8227467 2 Better class method invocations hotspot / runtime
JDK-8227542 2 Manifest improved jar headers core-svc / java.lang.instrument
JDK-8229733 2 TLS message handling improvements security-libs / javax.net.ssl
JDK-8231785 2 Improved socket permissions core-libs / java.net
JDK-8233250 2 Better X11 rendering client-libs / 2d
JDK-8233410 2 Better Build Scripting infrastructure / build
JDK-8234027 2 Better JCEKS key support security-libs / java.security
JDK-8236798 2 Enhance FX scripting support javafx / web
JDK-8238960 2 linux-i586 builds are inconsistent as the newly build jdk is not able to reserve enough space for object heap infrastructure / build
JDK-8239971 2 Enhance SQL queries javafx / web