This section lists and comments on the highlights of the changes in the selected update release.

This section lists all the changes in the selected update release.

Issue
Priority
Title
Component
Voting
JDK-7107012 3 sun.jvm.hostspot.code.CompressedReadStream readDouble() conversion to long mishandled hotspot / svc-agent 0
JDK-8197981 4 Missing return statement in __sync_val_compare_and_swap_8 hotspot / compiler 1
JDK-8199646 3 JShell tests: jdk/jshell/FailOverDirectExecutionControlTest.java failed with java.lang.UnsupportedOperationException tools / jshell 0
JDK-8198705 3 Javadoc search needs a fix to handle duplicate package names in different modules tools / javadoc(tool) 0
JDK-8208243 3 vmTestbase/gc/lock/jni/jnilock002/TestDescription.java fails in jdk/hs nightly hotspot / gc 0
JDK-8208207 3 Test nsk/stress/jni/gclocker/gcl001 fails after co-location hotspot / gc 0
JDK-8211977 4 move testlibrary tests into one place other-libs / other 0
JDK-8211974 4 move test/jdk/lib/testlibrary/java/util/jar/*.java to top-level library or a local library core-libs / java.util.jar 0
JDK-8217475 3 Unexpected StackOverflowError in "process reaper" thread core-libs / java.lang 0
JDK-8229495 2 SIGILL in C2 generated OSR compilation hotspot / compiler 0
JDK-8233014 3 Enable ShowCodeDetailsInExceptionMessages by default hotspot / runtime 0
JDK-8232114 3 JVM crashed at imjpapi.dll in native code client-libs / java.awt 7
JDK-8234605 3 C2 failed "assert(C->live_nodes() - live_at_begin <= 2 * _nodes_required) failed: Bad node estimate: actual = 208 >> request = 101" hotspot / compiler 0
JDK-8236809 4 [Graal] java/lang/Class/getDeclaredField/FieldSetAccessibleTest.java timeouts hotspot / compiler 0
JDK-8236647 3 java/lang/invoke/CallSiteTest.java failed with InvocationTargetException in Graal mode hotspot / compiler 0
JDK-8236539 2 Relative link tags in record javadoc don't resolve tools / javadoc(tool) 1
JDK-8236935 3 Improve UX of the search control tools / javadoc(tool) 1
JDK-8237488 3 jdk/jfr/event/compiler/TestCompilerCompile.java failed due to "RuntimeException: No thread in event" hotspot / jfr 0
JDK-8237950 3 C2 compilation fails with "Live Node limit exceeded limit" during ConvI2L::Ideal optimization hotspot / compiler 0
JDK-8237743 3 test/langtools/jdk/jshell/FailOverExecutionControlTest.java fails No ExecutionControlProvider with name 'nonExistent' and parameter keys: [] tools / jshell 0
JDK-8239105 3 Add exception for expiring Digicert root certificates to VerifyCACerts test security-libs / java.security 0
JDK-8238735 2 NPE compiling lambda expression within conditional expression tools / javac 1
JDK-8241065 4 Shenandoah: remove leftover code after JDK-8231086 hotspot / gc 0
JDK-8241007 4 Shenandoah: remove ShenandoahCriticalControlThreadPriority support hotspot / gc 0
JDK-8240777 2 Update all nroff manpages for JDK 15 release infrastructure / build 0
JDK-8241802 3 [Graal] compiler/loopopts/TestLogSum.java timed out hotspot / compiler 0
JDK-8241718 3 assert ((klass)->trace_id()) & ((JfrTraceIdEpoch::method_and_class_in_use_this_epoch_bits()))) != 0 in ObjectSampleCheckpoint::add_to_leakp_set hotspot / jfr 0
JDK-8241574 4 Shenandoah: remove ShenandoahAssertToSpaceClosure hotspot / gc 0
JDK-8242214 3 NullPointerException in JDK 14 javac compiling a method reference tools / javac 0
JDK-8241969 3 Type annotation is not shown for wildcard type in Javadoc tools / javadoc(tool) 1
JDK-8241907 3 Error when cross compiling with JDK 13, release flag and JFR package tools / javac 0
JDK-8241803 3 JFR TestThreadStartEndEvents.java failed due to "RuntimeException: Wrong thread id" hotspot / jfr 0
JDK-8242538 3 java/security/SecureRandom/ThreadSafe.java failed on windows security-libs / java.security 0
JDK-8242529 3 javac defines type annotations incorrectly for record members (constructor and property accessor) tools / javac 0
JDK-8242388 4 compiler/graalunit/CoreTest.java timed out hotspot / compiler 0
JDK-8242935 3 test/jdk/java/util/ServiceLoader/ReloadTest.java uses nashorn script engine core-libs / java.util 0
JDK-8242895 2 failed: sanity at src/hotspot/share/opto/escape.cpp:2361 hotspot / compiler 0
JDK-8243470 4 [macos] bring back O2 opt level for unsafe.cpp hotspot / runtime 0
JDK-8243321 3 Add Entrust root CA - G4 to Oracle Root CA program security-libs / java.security 0
JDK-8243320 3 Add SSL root certificates to Oracle Root CA program security-libs / java.security 0
JDK-8243670 2 Unexpected test result caused by C2 MergeMemNode::Ideal hotspot / compiler 0
JDK-8243533 3 Only one of several deprecated overloaded methods listed in the Deprecated list tools / javadoc(tool) 0
JDK-8244818 2 [macos] Java2D Queue Flusher crash while moving application window to external monitor client-libs / 2d 1
JDK-8244763 3 Update --release 8 symbol information after JSR 337 MR3 tools / javac 0
JDK-8244724 3 CTW: C2 compilation fails with "Live Node limit exceeded limit" hotspot / compiler 0
JDK-8245696 3 javadoc crashes when a doc-files directory contains a '#' file tools / javadoc(tool) 0
JDK-8245128 3 Kitchensink fails with: assert(destination == (address)-1 || destination == entry) failed: b) MT-unsafe modification of inline cache hotspot / compiler 0
JDK-8246078 3 Javadoc Search specification link from Javadoc Help page points to JDK 13 spec tools / javadoc(tool) 0
JDK-8246077 2 Cloneable test in HmacCore seems questionable security-libs / javax.crypto 0
JDK-8246051 3 [aarch64] SIGBUS by unaligned Unsafe compare_and_swap hotspot / compiler 0
JDK-8246031 3 SSLSocket.getSession() doesn't close connection for timeout/ interrupts security-libs / javax.net.ssl 0
JDK-8245842 3 provide tests for binary compatibility assertions for sealed classes tools / javac 0
JDK-8246212 3 JPKG001-012: application icon is missing in Control Panel Add/Remove tools / jpackage 0
JDK-8246114 2 java/net/MulticastSocket/Promiscuous.java fails after 8241072 (multi-homed systems) core-libs / java.net 0
JDK-8246098 3 API for Class::permittedSubclasses should clarify if returned elements are ordered or not core-libs / java.lang 0
JDK-8246094 2 [macos] Sound Recording and playback is not working infrastructure / build 0
JDK-8246381 3 VM crashes with "Current BasicObjectLock* below than low_mark" hotspot / compiler 0
JDK-8246257 2 Annotated record's vararg type component started to be uncompilable with JDK15b24 tools / javac 0
JDK-8246244 3 BasicShortcutHintTest shortcut can not be found tools / jpackage 0
JDK-8246806 3 Incorrect copyright header in KeyAgreementTest.java, GroupName.java security-libs / java.security 0
JDK-8246805 3 Incorrect copyright header in TestInvalidTieredStopAtLevel.java hotspot / compiler 0
JDK-8246704 2 --release => "unknown enum constant PreviewFeature$Feature.TEXT_BLOCKS" tools / javac 0
JDK-8246676 3 monitor list lock operations need more fencing hotspot / runtime 0
JDK-8247251 3 Assert '(_pcs_length == 0 || last_pc()->pc_offset() < pc_offset) failed: must specify a new, larger pc offset' failure hotspot / compiler 0
JDK-8247246 3 [JVMCI] `ResolvedJavaType.getDeclaredMethod()` can throw NoClassDefFoundError. hotspot / compiler 0
JDK-8247229 3 jpackage tests failed due to "semop(1): encountered an error: Invalid argument" tools / jpackage 0
JDK-8247200 3 [aarch64] assert((unsigned)fpargs < 32) hotspot / compiler 0
JDK-8247438 3 JShell: When FailOverExecutionControlProvider fails the proximal cause is not shown tools / jshell 0
JDK-8247421 3 [TESTBUG] ReturnBlobToWrongHeapTest.java failed allocating blob hotspot / compiler 0
JDK-8247382 3 doclint errors (missing comments) in jdk.compiler and jdk.javadoc tools / javadoc(tool) 0
JDK-8247358 3 Shenandoah: reconsider free budget slice for marking hotspot / gc 0
JDK-8247280 3 more fencing needed in async deflation for non-TSO machines hotspot / runtime 0
JDK-8247528 3 runtime/cds/appcds/jigsaw/modulepath/OptimizeModuleHandlingTest.java failing with Graal hotspot / runtime 0
JDK-8247527 3 serviceability/dcmd/gc/HeapDumpCompressedTest.java fails with Graal + ZGC hotspot / svc 0
JDK-8247526 3 [TESTBUG] runtime/cds/appcds/dynamicArchive tests failing with Graal hotspot / runtime 0
JDK-8247502 2 PhaseStringOpts crashes while optimising effectively dead code hotspot / compiler 0
JDK-8247444 3 Trust final fields in records core-libs / java.lang 0
JDK-8247696 3 Incorrect tail computation for large segments in AbstractMemorySegmentImpl::mismatch core-libs 0
JDK-8247670 2 Shenandoah: deadlock during class unloading OOME hotspot / gc 0
JDK-8247628 4 Records: Specify permitted accessibility of canonical constructor of a private record class specification / language 0
JDK-8247593 2 Shenandoah: should not block pacing reporters hotspot / gc 0
JDK-8247577 4 Stamp the Javadoc Search Specification with the JDK version tools / javadoc(tool) 0
JDK-8247532 2 Records deserialization is slow core-libs / java.io:serialization 0
JDK-8247741 4 Test test/hotspot/jtreg/runtime/7162488/TestUnrecognizedVmOption.java fails when -XX:+IgnoreUnrecognizedVMOptions is set hotspot / runtime 0
JDK-8247736 2 Shenandoah: assert(_nm->is_alive()) failed: only alive nmethods here hotspot / gc 0
JDK-8247725 4 move two tests for whitebox from test/hotspot/jtreg/sanity to test/lib-test hotspot / test 0
JDK-8247716 2 JVM_RegisterWhiteBoxMethods checks wrong classloader hotspot / test 0
JDK-8247780 3 Refine the Help page for API Documentation tools / javadoc(tool) 0
JDK-8247778 4 ZGC: More parallel gc/z/TestUncommit.java test configuration hotspot / gc 0
JDK-8247763 3 assert(outer->outcnt() == 2) failed: 'only phis' failure in LoopNode::verify_strip_mined() hotspot / compiler 0
JDK-8247757 4 Shenandoah: split heavy tests by heuristics to improve parallelism hotspot / gc 0
JDK-8247754 4 Shenandoah: mxbeans tests can be shorter hotspot / gc 0
JDK-8247751 4 Shenandoah: options tests should run with smaller heaps hotspot / gc 0
JDK-8247798 3 Update man pages for inline flags hotspot / compiler 0
JDK-8247789 3 Remove use of reflection from test/jdk/java/io/Serializable/records/StreamRefTest.java core-libs / java.io:serialization 0
JDK-8247788 3 DocCommentParser should not reject standalone '>' tools / javadoc(tool) 0
JDK-8247785 4 Small clarification of the javadoc about builtin class loaders core-libs / java.lang:class_loading 0
JDK-8247784 3 Bad link causes invalid documentation core-svc / debugger 0
JDK-8247849 3 permits clause of sealed interfaces should not allow parameterized types tools / javac 0
JDK-8247845 4 Shenandoah: refactor TLAB/GCLAB retirement code hotspot / gc 0
JDK-8247832 2 [Graal] Many Javafuzzer tests failures with Graal, due to unexpected results, after last update JDK-8243380 hotspot / compiler 0
JDK-8247824 3 CTW: C2 (Shenandoah) compilation fails with SEGV in SBC2Support::pin_and_expand hotspot / gc 0
JDK-8247815 3 doclint: recategorize "no description for ..." as MISSING, not SYNTAX tools / javadoc(tool) 0
JDK-8247896 3 Invalid (@throw) tags in 2 java.io classes core-libs / java.io 0
JDK-8247894 3 Invalid @see in java.management core-svc / javax.management 0
JDK-8247880 3 bad HTML(href==...) in table core-libs / java.nio 0
JDK-8247876 4 ProblemList various crypto tests on aarch64 security-libs / jdk.security 0
JDK-8247860 4 Shenandoah: add update watermark line in rich assert failure message hotspot / gc 0
JDK-8247936 3 Fix typos in man pages infrastructure / build 0
JDK-8247932 2 JShell crashes when typing text block tools / javac 0
JDK-8247913 4 Javadoc doc-comment-spec contains unintentional HTML char reference tools / javadoc(tool) 0
JDK-8247907 3 XMLDsig logging does not work security-libs / javax.xml.crypto 0
JDK-8247899 3 HTML errors and warnings in threadPrimitiveDeprecation.html core-libs / java.lang 0
JDK-8247967 2 SparkExamples24H.java SIGSEGV in various places hotspot / jfr 0
JDK-8247964 3 All log0() in com/sun/org/slf4j/internal/Logger.java should be private security-libs / javax.xml.crypto 0
JDK-8247959 3 doclint errors in NIO code core-libs / java.nio 0
JDK-8247958 3 minor HTML errors in com.sun.jdi core-svc / debugger 0
JDK-8247956 2 remove scripts under bin/nashorn and doc/nashorn/source core-libs / jdk.nashorn 0
JDK-8247955 3 doclint: don't complain about summary/caption when role=presentation tools / javadoc(tool) 0
JDK-8248048 1 ZGC: AArch64: SIGILL in load barrier register spilling hotspot / gc 0
JDK-8248044 4 Backout ProblemList-ed tests introduced by JDK-8247876 security-libs / java.security 0
JDK-8248041 3 Shenandoah: pre-Full GC root updates may miss some roots hotspot / gc 0
JDK-8248011 3 Improve javadoc of Foreign Memory Access API core-libs 0
JDK-8247992 3 [JVMCI] HotSpotNmethod.executeVarargs can try execute a zombie nmethod hotspot / compiler 0
JDK-8248135 4 Build microbenchmarks with --enable-preview infrastructure / build 0
JDK-8248112 3 array index out of bound in FileMapInfo::check_paths hotspot / runtime 0
JDK-8248061 4 bad reference in @throws in HotSpotDiagnosticMXBean core-svc / java.lang.management 0
JDK-8248060 4 small HTML issues in java.xml package-info.java files xml 0
JDK-8248059 3 [macos] EmptyFolderPackageTest.java failed "hdiutil: create failed - No child processes" tools / jpackage 0
JDK-8248254 3 jpackage fails if app module is in external runtime tools / jpackage 0
JDK-8248233 2 Avoid superfluous Class::isRecord invocations during deserialization core-libs / java.io:serialization 0
JDK-8248219 3 aarch64: missing memory barrier in fast_storefield and fast_accessfield hotspot / runtime 0
JDK-8248306 4 gc/stress/gclocker/TestExcessGCLockerCollections.java does not compile hotspot / gc 0
JDK-8248299 4 two jdeps files miss copyright header tools / javac 0
JDK-8248265 4 compiler/ciReplay tests fail with AOT compiled java.base hotspot / compiler 0
JDK-8248264 3 WinUpgradeUUIDTest application is missing in downgrade scenario tools / jpackage 0
JDK-8248255 3 [macos] Add failing DMG tests to problem list tools / jpackage 0
JDK-8248351 4 ProblemList serviceability/jvmti/ModuleAwareAgents/ThreadStart/MAAThreadStart.java on Windows hotspot / jvmti 0
JDK-8248348 3 Regression caused by the update to BCEL 6.0 xml / jaxp 0
JDK-8248341 4 ProblemList java/lang/management/ThreadMXBean/ThreadMXBeanStateTest.java core-svc / java.lang.management 0
JDK-8248339 4 ProblemList jdk/jfr/event/os/TestThreadContextSwitches.java hotspot / jfr 0
JDK-8248335 4 ProblemList compiler/ciReplay/TestServerVM.java and TestVMNoCompLevel.java with AOT hotspot / compiler 0
JDK-8248411 3 [aarch64] Insufficient error handling when CodeBuffer is exhausted hotspot / compiler 0
JDK-8248409 3 some jdk/javadoc/doclet tests fail (JDK 15) tools / javadoc(tool) 0
JDK-8248388 1 ZGC: Load barrier incorrectly elided in jdk/java/text/Format/DateFormat/SDFTCKZoneNamesTest.java hotspot / gc 0
JDK-8248358 4 ProblemList sun/nio/ch/TestMaxCachedBufferSize.java on macOSX core-libs / java.nio 0
JDK-8248354 4 ProblemList vmTestbase/nsk/jdi/stress/serial/mixed002/TestDescription.java core-svc / debugger 0
JDK-8248495 4 [macos] zerovm is broken due to libffi headers location infrastructure 0
JDK-8248485 3 Poor scalability in JfrCheckpointManager when using many threads after JDK-8242008 hotspot / jfr 0
JDK-8248476 3 No helpful NullPointerException message after calling fillInStackTrace. hotspot / runtime 0
JDK-8248475 3 Suppress unconditional warning "JFR will be disabled during CDS dumping" hotspot / jfr 0
JDK-8248467 4 C2: compiler/intrinsics/object/TestClone fails with -XX:+VerifyGraphEdges hotspot / compiler 0
JDK-8248427 3 jpackage jtreg BasicTest.testTemp() test fails on Windows tools / jpackage 0
JDK-8248570 3 Incorrect copyright header in TestUnsafeUnalignedSwap.java hotspot / compiler 0
JDK-8248505 2 Unexpected NoSuchAlgorithmException when using secure random impl from BCFIPS provider security-libs / java.security 0
JDK-8248501 3 [macos] App created with jpackage on Mac fails with error -10810 tools / jpackage 0
JDK-8248634 4 Shenandoah: incorrect include in shenandoahInitLogger.cpp hotspot / gc 0
JDK-8248632 4 Shenandoah: build fails without both JVMTI and JFR hotspot / gc 0
JDK-8248598 2 [Graal] Several testcases from applications/jcstress/acqrel.java fails with forbidden state hotspot / compiler 0
JDK-8248597 1 [Graal] api/java_security/SignatureSpi/DelegationTests.html fails with Method "javasoft.sqe.tests.api.java.security.SignatureSpi.JCKSignatureSpi.clear" doesn't exist. hotspot / compiler 0
JDK-8248596 4 [TESTBUG] compiler/loopopts/PartialPeelingUnswitch.java times out with Graal enabled hotspot / compiler 0
JDK-8248667 3 Need support for building native libraries located in the test/lib directory infrastructure / build 0
JDK-8248652 4 Shenandoah: SATB buffer handling may assume no forwarded objects hotspot / gc 0
JDK-8248745 3 Add jarsigner and keytool tests for restricted algorithms security-libs / java.security 0
JDK-8248725 2 Shenandoah: Claim verifier thread roots for parallel processing hotspot / gc 0
JDK-8248703 3 Clarify the behavior of java.net.NetworkInterface::equals core-libs / java.net 0
JDK-8248794 3 Transition JFR Periodic Task Thread to "_thread_in_native" before invoking performance counters hotspot / jfr 0
JDK-8248746 4 Undo jhsdb related exclusiveAccess.dirs changes that were done for JDK-8220295 hotspot / svc-agent 0
JDK-8248845 3 AArch64: stack corruption after spilling vector register hotspot / compiler 0
JDK-8248822 2 8 vm/classfmt/atr_ann/atr_rtm_annot007/atr_rtm_annot00709 tests fail w/ AOT hotspot / compiler 0
JDK-8248799 4 Shenandoah: Claim threads token in constructor of ShenandoahRootVerifier hotspot / gc 0
JDK-8249019 4 clean up FileInstaller $test.src $cwd in vmTestbase_vm_compiler tests hotspot / compiler 0
JDK-8249018 4 clean up FileInstaller $test.src $cwd in vmTestbase_vm_mlvm tests hotspot / compiler 0
JDK-8249000 4 vm.gc.X should take selected JIT into account hotspot / compiler 0
JDK-8248987 4 AOT's Linker.java seems to eagerly fail-fast on Windows. hotspot / compiler 0
JDK-8249033 4 clean up FileInstaller $test.src $cwd in vmTestbase_vm_metaspace tests hotspot / runtime 0
JDK-8249032 4 clean up FileInstaller $test.src $cwd in vmTestbase_nsk_sysdict tests hotspot / runtime 0
JDK-8249029 4 clean up FileInstaller $test.src $cwd in vmTestbase_vm_defmeth tests hotspot / runtime 0
JDK-8249028 4 clean up FileInstaller $test.src $cwd in vmTestbase_nsk_monitoring tests hotspot / svc 0
JDK-8249036 4 clean up FileInstaller $test.src $cwd in vmTestbase_nsk_stress tests hotspot / test 0
JDK-8249035 4 clean up FileInstaller $test.src $cwd in vmTestbase_nsk_jdwp tests hotspot / svc 0
JDK-8249034 4 clean up FileInstaller $test.src $cwd in vmTestbase_nsk_jvmti tests hotspot / svc 0
JDK-8249040 4 clean up FileInstaller $test.src $cwd in vmTestbase_nsk_jdb tests hotspot / svc 0
JDK-8249039 4 clean up FileInstaller $test.src $cwd in vmTestbase_nsk_aod tests hotspot / svc 0
JDK-8249038 4 clean up FileInstaller $test.src $cwd in vmTestbase_vm_gc tests hotspot / gc 0
JDK-8249037 4 clean up FileInstaller $test.src $cwd in vmTestbase_vm_g1classunloading tests hotspot / gc 0
JDK-8249176 4 jdk jtreg test security/infra/java/security/cert/CertPathValidator/certification/GlobalSignR6CA.java fails security-libs / java.security 0
JDK-8249165 4 Remove unneeded nops introduced by 8234160 changes hotspot / compiler 0
JDK-8249097 4 test/lib/jdk/test/lib/util/JarBuilder.java has a bad copyright core-libs / java.util.jar 0
JDK-8249086 3 JDK 15 L10n resource file update - msg drop 10 globalization / translation 0
JDK-8249205 4 Remove unnecessary trademark symbols core-libs 0
JDK-8249192 2 MonitorInfo stores raw oops across safepoints hotspot / runtime 0
JDK-8249183 3 JVM crash in "AwtFrame::WmSize" method client-libs / java.awt 3
JDK-8249251 2 [dark_mode ubuntu 20.04] The selected menu is not highlighted in GTKLookAndFeel client-libs / javax.swing 1
JDK-8249230 2 Shenandoah: assertion failure with -XX:-ResizeTLAB hotspot / gc 0
JDK-8249217 4 Unexpected StackOverflowError in "process reaper" thread still happens core-libs / java.lang 0
JDK-8249278 2 Revert JDK-8226253 which breaks the spec of AccessibleState.SHOWING for JList client-libs / javax.accessibility 2
JDK-8249258 2 java/util/StringJoiner/StringJoinerTest.java failed due to OOM core-libs / java.util 0
JDK-8249256 3 [macos] Add EmptyFolderPackageTest test to problem list tools / jpackage 0
JDK-8249255 2 Build fails if source code in cygwin home dir infrastructure / build 0
JDK-8249560 3 Shenandoah: Fix racy GC request handling hotspot / gc 0
JDK-8249543 4 (bf) Force DirectBufferAllocTest to run with -ExplicitGCInvokesConcurrent core-libs / java.nio 0
JDK-8249367 3 JShell uses 100% of one core all the time tools / jshell 0
JDK-8249673 4 cleanup graal problem lists hotspot / compiler 0
JDK-8249672 3 Include microcode revision in features_string on x86 hotspot / runtime 0
JDK-8249649 4 Shenandoah: provide per-cycle pacing stats hotspot / gc 0
JDK-8249622 4 use 8249621 to ignore 8 jvmci tests hotspot / compiler 0
JDK-8249700 4 java/io/File/GetXSpace.java should be added to exclude list, and not @ignore-d core-libs / java.io 0
JDK-8249698 4 java/lang/invoke/LFCaching/LFGarbageCollectedTest.java should be ProblemList-ed and not @ignored core-libs / java.lang.invoke 0
JDK-8249681 4 gc/stress/TestJNIBlockFullGC/TestJNIBlockFullGC.java fails w/ UnsatisfiedLinkError hotspot / gc 0
JDK-8249678 4 @ignore should be used instead of ProblemList for 8158860, 8163894, 8193479, 8194310 hotspot / compiler 0
JDK-8249787 4 Make TestGCLocker more resilient with concurrent GCs hotspot / gc 0
JDK-8249781 3 AArch64: AOT compiled code crashes if C2 allocates r27 hotspot / compiler 0
JDK-8249713 2 JFR: java.base events have incomplete stacktraces hotspot / jfr 0
JDK-8249880 2 JVMCI calling register_nmethod without CodeCache lock hotspot / compiler 0
JDK-8249801 4 Shenandoah: Clear soft-refs on requested GC cycle hotspot / gc 0
JDK-8250582 2 Revert Principal Name type to NT-UNKNOWN when requesting TGS Kerberos tickets security-libs / org.ietf.jgss:krb5 0
JDK-8250548 3 libgraal can deadlock in -Xcomp mode hotspot / compiler 0
JDK-8250216 4 The README need not mention retrieving source code infrastructure / build 0
JDK-8249953 4 Shenandoah: gc/shenandoah/mxbeans tests should account for corner cases hotspot / gc 0
JDK-8250609 2 C2 crash in IfNode::fold_compares hotspot / compiler 0
JDK-8250588 2 Shenandoah: LRB needs to save/restore fp registers for runtime call hotspot / gc 0
JDK-8250612 4 jvmciCompilerToVM.cpp declares jio_printf with "void" return type, should be "int" hotspot / compiler 0
JDK-8250770 2 Net.java translateToSocketException does not handle IOException core-libs / java.nio 0
JDK-8250688 4 missed open parenthesis for GTEST_FRAMEWORK_SRC var in Main.gmk hotspot / test 0
JDK-8250665 3 Wrong translation for the month of May in ar_JO, ar_LB and ar_SY globalization / locale-data 0
JDK-8250844 4 Make sure {type,obj}ArrayOopDesc accessors check the bounds hotspot / runtime 0
JDK-8250841 3 Shenandoah: need to reset/finish dead counters for StringTable/ResolvedMethodTable during STW root processing hotspot / gc 0
JDK-8250876 4 Fix issues with cross-compile on macos infrastructure / build 0
JDK-8250861 2 Crash in MinINode::Ideal(PhaseGVN*, bool) hotspot / compiler 0
JDK-8250928 3 JFR: Improve hash algorithm for stack traces hotspot / jfr 11
JDK-8251359 4 Shenandoah: filter null oops before calling enqueue/SATB barrier hotspot / gc 0
JDK-8251276 1 JDK-8248299 breaks JDK 15 validate-headers build tools 0
JDK-8251451 2 Shenandoah: Remark ObjectSynchronizer roots with I-U hotspot / gc 0
JDK-8251397 3 NPE on ClassValue.ClassValueMap.cacheArray core-libs / java.lang 1
JDK-8251458 3 Parse::do_lookupswitch fails with "assert(_cnt >= 0) failed" hotspot / compiler 0
JDK-8251910 3 Shenandoah: Handshake threads between weak-roots and reset phases hotspot / gc 0
JDK-8251859 2 sun/security/validator/PKIXValAndRevCheckTests.java fails with "RuntimeException: Received unexpected exception" security-libs / java.security 0
JDK-8252359 3 HotSpot Not Identifying it is Running in a Container hotspot / runtime 0
JDK-8252292 2 8240795 may cause anti-dependence to be missed hotspot / compiler 0
JDK-8252120 4 compiler/oracle/TestCompileCommand.java misspells "occured" hotspot / compiler 0
JDK-8252368 4 Undo JDK-8245002: Windows GDI functions don't support NUMA interleaving hotspot / gc 0
JDK-8252367 4 Undo JDK-8245000: Windows GDI functions don't support large pages hotspot / gc 0
JDK-8252470 4 java/awt/dnd/DisposeFrameOnDragCrash/DisposeFrameOnDragTest.java fails on Windows client-libs / java.awt 2
JDK-8252660 4 Shenandoah: support manageable SoftMaxHeapSize option hotspot / gc 0
JDK-8252754 3 Hash code calculation of JfrStackTrace is inconsistent hotspot / jfr 5
JDK-8253191 2 C2: Masked byte comparisons with large masks produce wrong result on x86 hotspot / compiler 0
JDK-8253226 4 Shenandoah: remove unimplemented ShenandoahStrDedupQueue::verify hotspot / gc 0
JDK-8253224 4 Shenandoah: ShenandoahStrDedupQueue destructor calls virtual num_queues() hotspot / gc 0
JDK-8253222 4 Shenandoah: unused AlwaysTrueClosure after JDK-8246591 hotspot / gc 0
JDK-8253284 2 Zero OrderAccess barrier mappings are incorrect hotspot / runtime 0
JDK-8253566 2 clazz.isAssignableFrom will return false for interface implementors hotspot / compiler 0
JDK-8253375 4 OSX build fails with Xcode 12.0 (12A7209) hotspot / runtime 0
JDK-8253727 3 [cgroups v2] Memory and swap limits reported incorrectly hotspot / runtime 0
JDK-8253714 3 [cgroups v2] Soft memory limit incorrectly using memory.high hotspot / runtime 0
JDK-8253791 3 Issue with useAppleColor check in CSystemColors.m client-libs / java.awt 1
JDK-8253778 2 ShenandoahSafepoint::is_at_shenandoah_safepoint should not access VMThread state from other threads hotspot / runtime 0
JDK-8253756 2 C2 CompilerThread0 crash in Node::add_req(Node*) hotspot / compiler 0
JDK-8253960 3 Memory leak in Java_java_lang_ClassLoader_defineClass0() core-libs / java.lang 0
JDK-8254144 4 Non-x86 Zero builds fail with return-type warning in os_linux_zero.cpp hotspot / runtime 8
JDK-8254081 2 java/security/cert/PolicyNode/GetPolicyQualifiers.java fails due to an expired certificate security-libs / java.security 0
JDK-8254177 3 (tz) Upgrade time-zone data to tzdata2020b core-libs / java.time 4
JDK-8254166 4 Zero: return-type warning in zeroInterpreter_zero.cpp hotspot / runtime 0
JDK-8254560 4 Shenandoah: Concurrent Strong Roots logging is incorrect hotspot / gc 0
JDK-8254320 4 Shenandoah: C2 native LRB should activate for non-cset objects hotspot / gc 0
JDK-8254319 2 Shenandoah: Interpreter native-LRB needs to activate during HAS_FORWARDED hotspot / gc 0
JDK-8254854 3 [cgroups v1] Metric limits not properly detected on some join controller combinations core-svc / tools 0
JDK-8254790 1 SIGSEGV in string_indexof_char and stringL_indexof_char intrinsics hotspot / compiler 0
JDK-8254982 3 (tz) Upgrade time-zone data to tzdata2020c core-libs / java.time 1
JDK-8255226 3 (tz) Upgrade time-zone data to tzdata2020d core-libs / java.time 1
JDK-8255067 5 Restore Copyright line in file modified by 8253191 hotspot / compiler 0
JDK-8255065 3 Zero: accessor_entry misses the IRIW case hotspot / runtime 0
JDK-8255603 2 Memory/Performance regression after JDK-8210985 security-libs / javax.net.ssl 0
JDK-8256427 4 Test com/sun/jndi/dns/ConfigTests/PortUnreachable.java does not work on AIX core-libs / java.net 0
JDK-8256051 2 nmethod_entry_barrier stub miscalculates xmm spill size on x86_32 hotspot / gc 0
JDK-8256618 4 Zero: Linux x86_32 build still fails hotspot / runtime 0
JDK-8257181 4 s390x builds are very noisy with gc-sections messages infrastructure / build 0
JDK-8257641 3 Shenandoah: Query is_at_shenandoah_safepoint() from control thread should return false hotspot / gc 0
JDK-8257701 2 Shenandoah: objArrayKlass metadata is not marked with chunked arrays hotspot / gc 0

This section organizes the changes in the selected update release by the main component under which each issue is filed.

Core Libs (33)

Issue
Priority
Title
Component
Voting
JDK-8211974 4 move test/jdk/lib/testlibrary/java/util/jar/*.java to top-level library or a local library core-libs / java.util.jar 0
JDK-8217475 3 Unexpected StackOverflowError in "process reaper" thread core-libs / java.lang 0
JDK-8242935 3 test/jdk/java/util/ServiceLoader/ReloadTest.java uses nashorn script engine core-libs / java.util 0
JDK-8246114 2 java/net/MulticastSocket/Promiscuous.java fails after 8241072 (multi-homed systems) core-libs / java.net 0
JDK-8246098 3 API for Class::permittedSubclasses should clarify if returned elements are ordered or not core-libs / java.lang 0
JDK-8247444 3 Trust final fields in records core-libs / java.lang 0
JDK-8247696 3 Incorrect tail computation for large segments in AbstractMemorySegmentImpl::mismatch core-libs 0
JDK-8247532 2 Records deserialization is slow core-libs / java.io:serialization 0
JDK-8247789 3 Remove use of reflection from test/jdk/java/io/Serializable/records/StreamRefTest.java core-libs / java.io:serialization 0
JDK-8247785 4 Small clarification of the javadoc about builtin class loaders core-libs / java.lang:class_loading 0
JDK-8247896 3 Invalid (@throw) tags in 2 java.io classes core-libs / java.io 0
JDK-8247880 3 bad HTML(href==...) in table core-libs / java.nio 0
JDK-8247899 3 HTML errors and warnings in threadPrimitiveDeprecation.html core-libs / java.lang 0
JDK-8247959 3 doclint errors in NIO code core-libs / java.nio 0
JDK-8247956 2 remove scripts under bin/nashorn and doc/nashorn/source core-libs / jdk.nashorn 0
JDK-8248011 3 Improve javadoc of Foreign Memory Access API core-libs 0
JDK-8248233 2 Avoid superfluous Class::isRecord invocations during deserialization core-libs / java.io:serialization 0
JDK-8248358 4 ProblemList sun/nio/ch/TestMaxCachedBufferSize.java on macOSX core-libs / java.nio 0
JDK-8248703 3 Clarify the behavior of java.net.NetworkInterface::equals core-libs / java.net 0
JDK-8249097 4 test/lib/jdk/test/lib/util/JarBuilder.java has a bad copyright core-libs / java.util.jar 0
JDK-8249205 4 Remove unnecessary trademark symbols core-libs 0
JDK-8249217 4 Unexpected StackOverflowError in "process reaper" thread still happens core-libs / java.lang 0
JDK-8249258 2 java/util/StringJoiner/StringJoinerTest.java failed due to OOM core-libs / java.util 0
JDK-8249543 4 (bf) Force DirectBufferAllocTest to run with -ExplicitGCInvokesConcurrent core-libs / java.nio 0
JDK-8249700 4 java/io/File/GetXSpace.java should be added to exclude list, and not @ignore-d core-libs / java.io 0
JDK-8249698 4 java/lang/invoke/LFCaching/LFGarbageCollectedTest.java should be ProblemList-ed and not @ignored core-libs / java.lang.invoke 0
JDK-8250770 2 Net.java translateToSocketException does not handle IOException core-libs / java.nio 0
JDK-8251397 3 NPE on ClassValue.ClassValueMap.cacheArray core-libs / java.lang 1
JDK-8253960 3 Memory leak in Java_java_lang_ClassLoader_defineClass0() core-libs / java.lang 0
JDK-8254177 3 (tz) Upgrade time-zone data to tzdata2020b core-libs / java.time 4
JDK-8254982 3 (tz) Upgrade time-zone data to tzdata2020c core-libs / java.time 1
JDK-8255226 3 (tz) Upgrade time-zone data to tzdata2020d core-libs / java.time 1
JDK-8256427 4 Test com/sun/jndi/dns/ConfigTests/PortUnreachable.java does not work on AIX core-libs / java.net 0

Security Libs (18)

Issue
Priority
Title
Component
Voting
JDK-8239105 3 Add exception for expiring Digicert root certificates to VerifyCACerts test security-libs / java.security 0
JDK-8242538 3 java/security/SecureRandom/ThreadSafe.java failed on windows security-libs / java.security 0
JDK-8243321 3 Add Entrust root CA - G4 to Oracle Root CA program security-libs / java.security 0
JDK-8243320 3 Add SSL root certificates to Oracle Root CA program security-libs / java.security 0
JDK-8246077 2 Cloneable test in HmacCore seems questionable security-libs / javax.crypto 0
JDK-8246031 3 SSLSocket.getSession() doesn't close connection for timeout/ interrupts security-libs / javax.net.ssl 0
JDK-8246806 3 Incorrect copyright header in KeyAgreementTest.java, GroupName.java security-libs / java.security 0
JDK-8247876 4 ProblemList various crypto tests on aarch64 security-libs / jdk.security 0
JDK-8247907 3 XMLDsig logging does not work security-libs / javax.xml.crypto 0
JDK-8247964 3 All log0() in com/sun/org/slf4j/internal/Logger.java should be private security-libs / javax.xml.crypto 0
JDK-8248044 4 Backout ProblemList-ed tests introduced by JDK-8247876 security-libs / java.security 0
JDK-8248505 2 Unexpected NoSuchAlgorithmException when using secure random impl from BCFIPS provider security-libs / java.security 0
JDK-8248745 3 Add jarsigner and keytool tests for restricted algorithms security-libs / java.security 0
JDK-8249176 4 jdk jtreg test security/infra/java/security/cert/CertPathValidator/certification/GlobalSignR6CA.java fails security-libs / java.security 0
JDK-8250582 2 Revert Principal Name type to NT-UNKNOWN when requesting TGS Kerberos tickets security-libs / org.ietf.jgss:krb5 0
JDK-8251859 2 sun/security/validator/PKIXValAndRevCheckTests.java fails with "RuntimeException: Received unexpected exception" security-libs / java.security 0
JDK-8254081 2 java/security/cert/PolicyNode/GetPolicyQualifiers.java fails due to an expired certificate security-libs / java.security 0
JDK-8255603 2 Memory/Performance regression after JDK-8210985 security-libs / javax.net.ssl 0

Hotspot (157)

Issue
Priority
Title
Component
Voting
JDK-7107012 3 sun.jvm.hostspot.code.CompressedReadStream readDouble() conversion to long mishandled hotspot / svc-agent 0
JDK-8197981 4 Missing return statement in __sync_val_compare_and_swap_8 hotspot / compiler 1
JDK-8208243 3 vmTestbase/gc/lock/jni/jnilock002/TestDescription.java fails in jdk/hs nightly hotspot / gc 0
JDK-8208207 3 Test nsk/stress/jni/gclocker/gcl001 fails after co-location hotspot / gc 0
JDK-8229495 2 SIGILL in C2 generated OSR compilation hotspot / compiler 0
JDK-8233014 3 Enable ShowCodeDetailsInExceptionMessages by default hotspot / runtime 0
JDK-8234605 3 C2 failed "assert(C->live_nodes() - live_at_begin <= 2 * _nodes_required) failed: Bad node estimate: actual = 208 >> request = 101" hotspot / compiler 0
JDK-8236809 4 [Graal] java/lang/Class/getDeclaredField/FieldSetAccessibleTest.java timeouts hotspot / compiler 0
JDK-8236647 3 java/lang/invoke/CallSiteTest.java failed with InvocationTargetException in Graal mode hotspot / compiler 0
JDK-8237488 3 jdk/jfr/event/compiler/TestCompilerCompile.java failed due to "RuntimeException: No thread in event" hotspot / jfr 0
JDK-8237950 3 C2 compilation fails with "Live Node limit exceeded limit" during ConvI2L::Ideal optimization hotspot / compiler 0
JDK-8241065 4 Shenandoah: remove leftover code after JDK-8231086 hotspot / gc 0
JDK-8241007 4 Shenandoah: remove ShenandoahCriticalControlThreadPriority support hotspot / gc 0
JDK-8241802 3 [Graal] compiler/loopopts/TestLogSum.java timed out hotspot / compiler 0
JDK-8241718 3 assert ((klass)->trace_id()) & ((JfrTraceIdEpoch::method_and_class_in_use_this_epoch_bits()))) != 0 in ObjectSampleCheckpoint::add_to_leakp_set hotspot / jfr 0
JDK-8241574 4 Shenandoah: remove ShenandoahAssertToSpaceClosure hotspot / gc 0
JDK-8241803 3 JFR TestThreadStartEndEvents.java failed due to "RuntimeException: Wrong thread id" hotspot / jfr 0
JDK-8242388 4 compiler/graalunit/CoreTest.java timed out hotspot / compiler 0
JDK-8242895 2 failed: sanity at src/hotspot/share/opto/escape.cpp:2361 hotspot / compiler 0
JDK-8243470 4 [macos] bring back O2 opt level for unsafe.cpp hotspot / runtime 0
JDK-8243670 2 Unexpected test result caused by C2 MergeMemNode::Ideal hotspot / compiler 0
JDK-8244724 3 CTW: C2 compilation fails with "Live Node limit exceeded limit" hotspot / compiler 0
JDK-8245128 3 Kitchensink fails with: assert(destination == (address)-1 || destination == entry) failed: b) MT-unsafe modification of inline cache hotspot / compiler 0
JDK-8246051 3 [aarch64] SIGBUS by unaligned Unsafe compare_and_swap hotspot / compiler 0
JDK-8246381 3 VM crashes with "Current BasicObjectLock* below than low_mark" hotspot / compiler 0
JDK-8246805 3 Incorrect copyright header in TestInvalidTieredStopAtLevel.java hotspot / compiler 0
JDK-8246676 3 monitor list lock operations need more fencing hotspot / runtime 0
JDK-8247251 3 Assert '(_pcs_length == 0 || last_pc()->pc_offset() < pc_offset) failed: must specify a new, larger pc offset' failure hotspot / compiler 0
JDK-8247246 3 [JVMCI] `ResolvedJavaType.getDeclaredMethod()` can throw NoClassDefFoundError. hotspot / compiler 0
JDK-8247200 3 [aarch64] assert((unsigned)fpargs < 32) hotspot / compiler 0
JDK-8247421 3 [TESTBUG] ReturnBlobToWrongHeapTest.java failed allocating blob hotspot / compiler 0
JDK-8247358 3 Shenandoah: reconsider free budget slice for marking hotspot / gc 0
JDK-8247280 3 more fencing needed in async deflation for non-TSO machines hotspot / runtime 0
JDK-8247528 3 runtime/cds/appcds/jigsaw/modulepath/OptimizeModuleHandlingTest.java failing with Graal hotspot / runtime 0
JDK-8247527 3 serviceability/dcmd/gc/HeapDumpCompressedTest.java fails with Graal + ZGC hotspot / svc 0
JDK-8247526 3 [TESTBUG] runtime/cds/appcds/dynamicArchive tests failing with Graal hotspot / runtime 0
JDK-8247502 2 PhaseStringOpts crashes while optimising effectively dead code hotspot / compiler 0
JDK-8247670 2 Shenandoah: deadlock during class unloading OOME hotspot / gc 0
JDK-8247593 2 Shenandoah: should not block pacing reporters hotspot / gc 0
JDK-8247741 4 Test test/hotspot/jtreg/runtime/7162488/TestUnrecognizedVmOption.java fails when -XX:+IgnoreUnrecognizedVMOptions is set hotspot / runtime 0
JDK-8247736 2 Shenandoah: assert(_nm->is_alive()) failed: only alive nmethods here hotspot / gc 0
JDK-8247725 4 move two tests for whitebox from test/hotspot/jtreg/sanity to test/lib-test hotspot / test 0
JDK-8247716 2 JVM_RegisterWhiteBoxMethods checks wrong classloader hotspot / test 0
JDK-8247778 4 ZGC: More parallel gc/z/TestUncommit.java test configuration hotspot / gc 0
JDK-8247763 3 assert(outer->outcnt() == 2) failed: 'only phis' failure in LoopNode::verify_strip_mined() hotspot / compiler 0
JDK-8247757 4 Shenandoah: split heavy tests by heuristics to improve parallelism hotspot / gc 0
JDK-8247754 4 Shenandoah: mxbeans tests can be shorter hotspot / gc 0
JDK-8247751 4 Shenandoah: options tests should run with smaller heaps hotspot / gc 0
JDK-8247798 3 Update man pages for inline flags hotspot / compiler 0
JDK-8247845 4 Shenandoah: refactor TLAB/GCLAB retirement code hotspot / gc 0
JDK-8247832 2 [Graal] Many Javafuzzer tests failures with Graal, due to unexpected results, after last update JDK-8243380 hotspot / compiler 0
JDK-8247824 3 CTW: C2 (Shenandoah) compilation fails with SEGV in SBC2Support::pin_and_expand hotspot / gc 0
JDK-8247860 4 Shenandoah: add update watermark line in rich assert failure message hotspot / gc 0
JDK-8247967 2 SparkExamples24H.java SIGSEGV in various places hotspot / jfr 0
JDK-8248048 1 ZGC: AArch64: SIGILL in load barrier register spilling hotspot / gc 0
JDK-8248041 3 Shenandoah: pre-Full GC root updates may miss some roots hotspot / gc 0
JDK-8247992 3 [JVMCI] HotSpotNmethod.executeVarargs can try execute a zombie nmethod hotspot / compiler 0
JDK-8248112 3 array index out of bound in FileMapInfo::check_paths hotspot / runtime 0
JDK-8248219 3 aarch64: missing memory barrier in fast_storefield and fast_accessfield hotspot / runtime 0
JDK-8248306 4 gc/stress/gclocker/TestExcessGCLockerCollections.java does not compile hotspot / gc 0
JDK-8248265 4 compiler/ciReplay tests fail with AOT compiled java.base hotspot / compiler 0
JDK-8248351 4 ProblemList serviceability/jvmti/ModuleAwareAgents/ThreadStart/MAAThreadStart.java on Windows hotspot / jvmti 0
JDK-8248339 4 ProblemList jdk/jfr/event/os/TestThreadContextSwitches.java hotspot / jfr 0
JDK-8248335 4 ProblemList compiler/ciReplay/TestServerVM.java and TestVMNoCompLevel.java with AOT hotspot / compiler 0
JDK-8248411 3 [aarch64] Insufficient error handling when CodeBuffer is exhausted hotspot / compiler 0
JDK-8248388 1 ZGC: Load barrier incorrectly elided in jdk/java/text/Format/DateFormat/SDFTCKZoneNamesTest.java hotspot / gc 0
JDK-8248485 3 Poor scalability in JfrCheckpointManager when using many threads after JDK-8242008 hotspot / jfr 0
JDK-8248476 3 No helpful NullPointerException message after calling fillInStackTrace. hotspot / runtime 0
JDK-8248475 3 Suppress unconditional warning "JFR will be disabled during CDS dumping" hotspot / jfr 0
JDK-8248467 4 C2: compiler/intrinsics/object/TestClone fails with -XX:+VerifyGraphEdges hotspot / compiler 0
JDK-8248570 3 Incorrect copyright header in TestUnsafeUnalignedSwap.java hotspot / compiler 0
JDK-8248634 4 Shenandoah: incorrect include in shenandoahInitLogger.cpp hotspot / gc 0
JDK-8248632 4 Shenandoah: build fails without both JVMTI and JFR hotspot / gc 0
JDK-8248598 2 [Graal] Several testcases from applications/jcstress/acqrel.java fails with forbidden state hotspot / compiler 0
JDK-8248597 1 [Graal] api/java_security/SignatureSpi/DelegationTests.html fails with Method "javasoft.sqe.tests.api.java.security.SignatureSpi.JCKSignatureSpi.clear" doesn't exist. hotspot / compiler 0
JDK-8248596 4 [TESTBUG] compiler/loopopts/PartialPeelingUnswitch.java times out with Graal enabled hotspot / compiler 0
JDK-8248652 4 Shenandoah: SATB buffer handling may assume no forwarded objects hotspot / gc 0
JDK-8248725 2 Shenandoah: Claim verifier thread roots for parallel processing hotspot / gc 0
JDK-8248794 3 Transition JFR Periodic Task Thread to "_thread_in_native" before invoking performance counters hotspot / jfr 0
JDK-8248746 4 Undo jhsdb related exclusiveAccess.dirs changes that were done for JDK-8220295 hotspot / svc-agent 0
JDK-8248845 3 AArch64: stack corruption after spilling vector register hotspot / compiler 0
JDK-8248822 2 8 vm/classfmt/atr_ann/atr_rtm_annot007/atr_rtm_annot00709 tests fail w/ AOT hotspot / compiler 0
JDK-8248799 4 Shenandoah: Claim threads token in constructor of ShenandoahRootVerifier hotspot / gc 0
JDK-8249019 4 clean up FileInstaller $test.src $cwd in vmTestbase_vm_compiler tests hotspot / compiler 0
JDK-8249018 4 clean up FileInstaller $test.src $cwd in vmTestbase_vm_mlvm tests hotspot / compiler 0
JDK-8249000 4 vm.gc.X should take selected JIT into account hotspot / compiler 0
JDK-8248987 4 AOT's Linker.java seems to eagerly fail-fast on Windows. hotspot / compiler 0
JDK-8249033 4 clean up FileInstaller $test.src $cwd in vmTestbase_vm_metaspace tests hotspot / runtime 0
JDK-8249032 4 clean up FileInstaller $test.src $cwd in vmTestbase_nsk_sysdict tests hotspot / runtime 0
JDK-8249029 4 clean up FileInstaller $test.src $cwd in vmTestbase_vm_defmeth tests hotspot / runtime 0
JDK-8249028 4 clean up FileInstaller $test.src $cwd in vmTestbase_nsk_monitoring tests hotspot / svc 0
JDK-8249036 4 clean up FileInstaller $test.src $cwd in vmTestbase_nsk_stress tests hotspot / test 0
JDK-8249035 4 clean up FileInstaller $test.src $cwd in vmTestbase_nsk_jdwp tests hotspot / svc 0
JDK-8249034 4 clean up FileInstaller $test.src $cwd in vmTestbase_nsk_jvmti tests hotspot / svc 0
JDK-8249040 4 clean up FileInstaller $test.src $cwd in vmTestbase_nsk_jdb tests hotspot / svc 0
JDK-8249039 4 clean up FileInstaller $test.src $cwd in vmTestbase_nsk_aod tests hotspot / svc 0
JDK-8249038 4 clean up FileInstaller $test.src $cwd in vmTestbase_vm_gc tests hotspot / gc 0
JDK-8249037 4 clean up FileInstaller $test.src $cwd in vmTestbase_vm_g1classunloading tests hotspot / gc 0
JDK-8249165 4 Remove unneeded nops introduced by 8234160 changes hotspot / compiler 0
JDK-8249192 2 MonitorInfo stores raw oops across safepoints hotspot / runtime 0
JDK-8249230 2 Shenandoah: assertion failure with -XX:-ResizeTLAB hotspot / gc 0
JDK-8249560 3 Shenandoah: Fix racy GC request handling hotspot / gc 0
JDK-8249673 4 cleanup graal problem lists hotspot / compiler 0
JDK-8249672 3 Include microcode revision in features_string on x86 hotspot / runtime 0
JDK-8249649 4 Shenandoah: provide per-cycle pacing stats hotspot / gc 0
JDK-8249622 4 use 8249621 to ignore 8 jvmci tests hotspot / compiler 0
JDK-8249681 4 gc/stress/TestJNIBlockFullGC/TestJNIBlockFullGC.java fails w/ UnsatisfiedLinkError hotspot / gc 0
JDK-8249678 4 @ignore should be used instead of ProblemList for 8158860, 8163894, 8193479, 8194310 hotspot / compiler 0
JDK-8249787 4 Make TestGCLocker more resilient with concurrent GCs hotspot / gc 0
JDK-8249781 3 AArch64: AOT compiled code crashes if C2 allocates r27 hotspot / compiler 0
JDK-8249713 2 JFR: java.base events have incomplete stacktraces hotspot / jfr 0
JDK-8249880 2 JVMCI calling register_nmethod without CodeCache lock hotspot / compiler 0
JDK-8249801 4 Shenandoah: Clear soft-refs on requested GC cycle hotspot / gc 0
JDK-8250548 3 libgraal can deadlock in -Xcomp mode hotspot / compiler 0
JDK-8249953 4 Shenandoah: gc/shenandoah/mxbeans tests should account for corner cases hotspot / gc 0
JDK-8250609 2 C2 crash in IfNode::fold_compares hotspot / compiler 0
JDK-8250588 2 Shenandoah: LRB needs to save/restore fp registers for runtime call hotspot / gc 0
JDK-8250612 4 jvmciCompilerToVM.cpp declares jio_printf with "void" return type, should be "int" hotspot / compiler 0
JDK-8250688 4 missed open parenthesis for GTEST_FRAMEWORK_SRC var in Main.gmk hotspot / test 0
JDK-8250844 4 Make sure {type,obj}ArrayOopDesc accessors check the bounds hotspot / runtime 0
JDK-8250841 3 Shenandoah: need to reset/finish dead counters for StringTable/ResolvedMethodTable during STW root processing hotspot / gc 0
JDK-8250861 2 Crash in MinINode::Ideal(PhaseGVN*, bool) hotspot / compiler 0
JDK-8250928 3 JFR: Improve hash algorithm for stack traces hotspot / jfr 11
JDK-8251359 4 Shenandoah: filter null oops before calling enqueue/SATB barrier hotspot / gc 0
JDK-8251451 2 Shenandoah: Remark ObjectSynchronizer roots with I-U hotspot / gc 0
JDK-8251458 3 Parse::do_lookupswitch fails with "assert(_cnt >= 0) failed" hotspot / compiler 0
JDK-8251910 3 Shenandoah: Handshake threads between weak-roots and reset phases hotspot / gc 0
JDK-8252359 3 HotSpot Not Identifying it is Running in a Container hotspot / runtime 0
JDK-8252292 2 8240795 may cause anti-dependence to be missed hotspot / compiler 0
JDK-8252120 4 compiler/oracle/TestCompileCommand.java misspells "occured" hotspot / compiler 0
JDK-8252368 4 Undo JDK-8245002: Windows GDI functions don't support NUMA interleaving hotspot / gc 0
JDK-8252367 4 Undo JDK-8245000: Windows GDI functions don't support large pages hotspot / gc 0
JDK-8252660 4 Shenandoah: support manageable SoftMaxHeapSize option hotspot / gc 0
JDK-8252754 3 Hash code calculation of JfrStackTrace is inconsistent hotspot / jfr 5
JDK-8253191 2 C2: Masked byte comparisons with large masks produce wrong result on x86 hotspot / compiler 0
JDK-8253226 4 Shenandoah: remove unimplemented ShenandoahStrDedupQueue::verify hotspot / gc 0
JDK-8253224 4 Shenandoah: ShenandoahStrDedupQueue destructor calls virtual num_queues() hotspot / gc 0
JDK-8253222 4 Shenandoah: unused AlwaysTrueClosure after JDK-8246591 hotspot / gc 0
JDK-8253284 2 Zero OrderAccess barrier mappings are incorrect hotspot / runtime 0
JDK-8253566 2 clazz.isAssignableFrom will return false for interface implementors hotspot / compiler 0
JDK-8253375 4 OSX build fails with Xcode 12.0 (12A7209) hotspot / runtime 0
JDK-8253727 3 [cgroups v2] Memory and swap limits reported incorrectly hotspot / runtime 0
JDK-8253714 3 [cgroups v2] Soft memory limit incorrectly using memory.high hotspot / runtime 0
JDK-8253778 2 ShenandoahSafepoint::is_at_shenandoah_safepoint should not access VMThread state from other threads hotspot / runtime 0
JDK-8253756 2 C2 CompilerThread0 crash in Node::add_req(Node*) hotspot / compiler 0
JDK-8254144 4 Non-x86 Zero builds fail with return-type warning in os_linux_zero.cpp hotspot / runtime 8
JDK-8254166 4 Zero: return-type warning in zeroInterpreter_zero.cpp hotspot / runtime 0
JDK-8254560 4 Shenandoah: Concurrent Strong Roots logging is incorrect hotspot / gc 0
JDK-8254320 4 Shenandoah: C2 native LRB should activate for non-cset objects hotspot / gc 0
JDK-8254319 2 Shenandoah: Interpreter native-LRB needs to activate during HAS_FORWARDED hotspot / gc 0
JDK-8254790 1 SIGSEGV in string_indexof_char and stringL_indexof_char intrinsics hotspot / compiler 0
JDK-8255067 5 Restore Copyright line in file modified by 8253191 hotspot / compiler 0
JDK-8255065 3 Zero: accessor_entry misses the IRIW case hotspot / runtime 0
JDK-8256051 2 nmethod_entry_barrier stub miscalculates xmm spill size on x86_32 hotspot / gc 0
JDK-8256618 4 Zero: Linux x86_32 build still fails hotspot / runtime 0
JDK-8257641 3 Shenandoah: Query is_at_shenandoah_safepoint() from control thread should return false hotspot / gc 0
JDK-8257701 2 Shenandoah: objArrayKlass metadata is not marked with chunked arrays hotspot / gc 0

Client Libs (7)

Issue
Priority
Title
Component
Voting
JDK-8232114 3 JVM crashed at imjpapi.dll in native code client-libs / java.awt 7
JDK-8244818 2 [macos] Java2D Queue Flusher crash while moving application window to external monitor client-libs / 2d 1
JDK-8249183 3 JVM crash in "AwtFrame::WmSize" method client-libs / java.awt 3
JDK-8249251 2 [dark_mode ubuntu 20.04] The selected menu is not highlighted in GTKLookAndFeel client-libs / javax.swing 1
JDK-8249278 2 Revert JDK-8226253 which breaks the spec of AccessibleState.SHOWING for JList client-libs / javax.accessibility 2
JDK-8252470 4 java/awt/dnd/DisposeFrameOnDragCrash/DisposeFrameOnDragTest.java fails on Windows client-libs / java.awt 2
JDK-8253791 3 Issue with useAppleColor check in CSystemColors.m client-libs / java.awt 1

Other (64)

Issue
Priority
Title
Component
Voting
JDK-8199646 3 JShell tests: jdk/jshell/FailOverDirectExecutionControlTest.java failed with java.lang.UnsupportedOperationException tools / jshell 0
JDK-8198705 3 Javadoc search needs a fix to handle duplicate package names in different modules tools / javadoc(tool) 0
JDK-8211977 4 move testlibrary tests into one place other-libs / other 0
JDK-8236539 2 Relative link tags in record javadoc don't resolve tools / javadoc(tool) 1
JDK-8236935 3 Improve UX of the search control tools / javadoc(tool) 1
JDK-8237743 3 test/langtools/jdk/jshell/FailOverExecutionControlTest.java fails No ExecutionControlProvider with name 'nonExistent' and parameter keys: [] tools / jshell 0
JDK-8238735 2 NPE compiling lambda expression within conditional expression tools / javac 1
JDK-8240777 2 Update all nroff manpages for JDK 15 release infrastructure / build 0
JDK-8242214 3 NullPointerException in JDK 14 javac compiling a method reference tools / javac 0
JDK-8241969 3 Type annotation is not shown for wildcard type in Javadoc tools / javadoc(tool) 1
JDK-8241907 3 Error when cross compiling with JDK 13, release flag and JFR package tools / javac 0
JDK-8242529 3 javac defines type annotations incorrectly for record members (constructor and property accessor) tools / javac 0
JDK-8243533 3 Only one of several deprecated overloaded methods listed in the Deprecated list tools / javadoc(tool) 0
JDK-8244763 3 Update --release 8 symbol information after JSR 337 MR3 tools / javac 0
JDK-8245696 3 javadoc crashes when a doc-files directory contains a '#' file tools / javadoc(tool) 0
JDK-8246078 3 Javadoc Search specification link from Javadoc Help page points to JDK 13 spec tools / javadoc(tool) 0
JDK-8245842 3 provide tests for binary compatibility assertions for sealed classes tools / javac 0
JDK-8246212 3 JPKG001-012: application icon is missing in Control Panel Add/Remove tools / jpackage 0
JDK-8246094 2 [macos] Sound Recording and playback is not working infrastructure / build 0
JDK-8246257 2 Annotated record's vararg type component started to be uncompilable with JDK15b24 tools / javac 0
JDK-8246244 3 BasicShortcutHintTest shortcut can not be found tools / jpackage 0
JDK-8246704 2 --release => "unknown enum constant PreviewFeature$Feature.TEXT_BLOCKS" tools / javac 0
JDK-8247229 3 jpackage tests failed due to "semop(1): encountered an error: Invalid argument" tools / jpackage 0
JDK-8247438 3 JShell: When FailOverExecutionControlProvider fails the proximal cause is not shown tools / jshell 0
JDK-8247382 3 doclint errors (missing comments) in jdk.compiler and jdk.javadoc tools / javadoc(tool) 0
JDK-8247628 4 Records: Specify permitted accessibility of canonical constructor of a private record class specification / language 0
JDK-8247577 4 Stamp the Javadoc Search Specification with the JDK version tools / javadoc(tool) 0
JDK-8247780 3 Refine the Help page for API Documentation tools / javadoc(tool) 0
JDK-8247788 3 DocCommentParser should not reject standalone '>' tools / javadoc(tool) 0
JDK-8247784 3 Bad link causes invalid documentation core-svc / debugger 0
JDK-8247849 3 permits clause of sealed interfaces should not allow parameterized types tools / javac 0
JDK-8247815 3 doclint: recategorize "no description for ..." as MISSING, not SYNTAX tools / javadoc(tool) 0
JDK-8247894 3 Invalid @see in java.management core-svc / javax.management 0
JDK-8247936 3 Fix typos in man pages infrastructure / build 0
JDK-8247932 2 JShell crashes when typing text block tools / javac 0
JDK-8247913 4 Javadoc doc-comment-spec contains unintentional HTML char reference tools / javadoc(tool) 0
JDK-8247958 3 minor HTML errors in com.sun.jdi core-svc / debugger 0
JDK-8247955 3 doclint: don't complain about summary/caption when role=presentation tools / javadoc(tool) 0
JDK-8248135 4 Build microbenchmarks with --enable-preview infrastructure / build 0
JDK-8248061 4 bad reference in @throws in HotSpotDiagnosticMXBean core-svc / java.lang.management 0
JDK-8248060 4 small HTML issues in java.xml package-info.java files xml 0
JDK-8248059 3 [macos] EmptyFolderPackageTest.java failed "hdiutil: create failed - No child processes" tools / jpackage 0
JDK-8248254 3 jpackage fails if app module is in external runtime tools / jpackage 0
JDK-8248299 4 two jdeps files miss copyright header tools / javac 0
JDK-8248264 3 WinUpgradeUUIDTest application is missing in downgrade scenario tools / jpackage 0
JDK-8248255 3 [macos] Add failing DMG tests to problem list tools / jpackage 0
JDK-8248348 3 Regression caused by the update to BCEL 6.0 xml / jaxp 0
JDK-8248341 4 ProblemList java/lang/management/ThreadMXBean/ThreadMXBeanStateTest.java core-svc / java.lang.management 0
JDK-8248409 3 some jdk/javadoc/doclet tests fail (JDK 15) tools / javadoc(tool) 0
JDK-8248354 4 ProblemList vmTestbase/nsk/jdi/stress/serial/mixed002/TestDescription.java core-svc / debugger 0
JDK-8248495 4 [macos] zerovm is broken due to libffi headers location infrastructure 0
JDK-8248427 3 jpackage jtreg BasicTest.testTemp() test fails on Windows tools / jpackage 0
JDK-8248501 3 [macos] App created with jpackage on Mac fails with error -10810 tools / jpackage 0
JDK-8248667 3 Need support for building native libraries located in the test/lib directory infrastructure / build 0
JDK-8249086 3 JDK 15 L10n resource file update - msg drop 10 globalization / translation 0
JDK-8249256 3 [macos] Add EmptyFolderPackageTest test to problem list tools / jpackage 0
JDK-8249255 2 Build fails if source code in cygwin home dir infrastructure / build 0
JDK-8249367 3 JShell uses 100% of one core all the time tools / jshell 0
JDK-8250216 4 The README need not mention retrieving source code infrastructure / build 0
JDK-8250665 3 Wrong translation for the month of May in ar_JO, ar_LB and ar_SY globalization / locale-data 0
JDK-8250876 4 Fix issues with cross-compile on macos infrastructure / build 0
JDK-8251276 1 JDK-8248299 breaks JDK 15 validate-headers build tools 0
JDK-8254854 3 [cgroups v1] Metric limits not properly detected on some join controller combinations core-svc / tools 0
JDK-8257181 4 s390x builds are very noisy with gc-sections messages infrastructure / build 0