This section lists and comments on the highlights of the changes in the selected update release.

Issue
Priority
Title
Component
Foojay Commentary
Category
Voting
JDK-7124307 4 JSpinner and changing value by mouse client-libs / javax.swing 3
JDK-8221823 3 Requested JDialog width is ignored client-libs / java.awt 2
JDK-6933331 4 (d3d/ogl) java.lang.IllegalStateException: Buffers have not been created client-libs / 2d 2
JDK-8198001 4 java/awt/Menu/WrongParentAfterRemoveMenu/WrongParentAfterRemoveMenu.java debug assert on Windows client-libs / java.awt 1
JDK-8080353 4 JShell: Better error message on attempting to add default method tools / jshell 1
JDK-8212986 4 Make Visual Studio compiler check less strict infrastructure / build 1
JDK-8203672 3 JNI exception pending in PlainSocketImpl.c core-libs / java.net 1
JDK-8206179 4 com/sun/management/OperatingSystemMXBean/GetCommittedVirtualMemorySize.java fails with Committed virtual memory size illegal value core-svc / javax.management 1
JDK-8040630 3 Popup menus and tooltips flicker with previous popup contents when first shown client-libs / javax.swing 1
JDK-8039082 4 [TEST_BUG] Test java/awt/dnd/BadSerializationTest/BadSerializationTest.java fails client-libs / java.awt 1
JDK-4949105 3 Access Bridge lacks html tags parsing client-libs / javax.accessibility 1
JDK-8022574 4 remove HaltNode code after uncommon trap calls hotspot / compiler 1

This section lists all the changes in the selected update release.

Issue
Priority
Title
Component
Voting
JDK-7124307 4 JSpinner and changing value by mouse client-libs / javax.swing 3
JDK-6933331 4 (d3d/ogl) java.lang.IllegalStateException: Buffers have not been created client-libs / 2d 2
JDK-4949105 3 Access Bridge lacks html tags parsing client-libs / javax.accessibility 1
JDK-8022574 4 remove HaltNode code after uncommon trap calls hotspot / compiler 1
JDK-8039082 4 [TEST_BUG] Test java/awt/dnd/BadSerializationTest/BadSerializationTest.java fails client-libs / java.awt 1
JDK-8040630 3 Popup menus and tooltips flicker with previous popup contents when first shown client-libs / javax.swing 1
JDK-8048215 4 [TESTBUG] java/lang/management/ManagementFactory/ThreadMXBeanProxy.java Expected non-null LockInfo core-svc / java.lang.management 0
JDK-8044365 4 (dc) MulticastSendReceiveTests.java failing with ENOMEM when joining group (OS X 10.9) core-libs / java.nio 0
JDK-8051349 4 nsk/jvmti/scenarios/sampling/SP06/sp06t003 fails in nightly hotspot / jvmti 0
JDK-8080353 4 JShell: Better error message on attempting to add default method tools / jshell 1
JDK-8146090 3 java/lang/ref/ReachabilityFenceTest.java fails with -XX:+DeoptimizeALot core-libs / java.lang 0
JDK-8139876 3 Exclude hanging nsk/stress/stack from execution with deoptimization enabled hotspot / runtime 0
JDK-8159740 5 JShell: corralled declarations do not have correct source to wrapper mapping tools / jshell 0
JDK-8156207 5 Resource allocated BitMaps are often cleared unnecessarily hotspot / compiler 0
JDK-8153430 4 TESTBUG: jdk regression test javax/management/loading/MletParserLocaleTest.java reduce default timeout core-svc / javax.management 0
JDK-8160926 3 FLAGS_COMPILER_CHECK_ARGUMENTS doesn\'t handle cross-compilation infrastructure / build 0
JDK-8175984 4 ICC_Profile has un-needed, not-empty finalize method client-libs / 2d 0
JDK-8176359 3 Frame#setMaximizedbounds not working properly in multi screen environments client-libs / java.awt 0
JDK-8183369 3 RFC unconformity of HttpURLConnection with proxy core-libs / java.net 0
JDK-8187078 4 -XX:+VerifyOops finds numerous problems when running JPRT hotspot / compiler 0
JDK-8191169 4 java/net/Authenticator/B4769350.java failed intermittently core-libs / java.net 0
JDK-8189861 4 Refactor CacheFind infrastructure / build 0
JDK-8191930 5 [Graal] emits unparseable XML into compile log hotspot / compiler 0
JDK-8193879 3 Java debugger hangs on method invocation core-svc / debugger 0
JDK-8196181 4 sun/java2d/GdiRendering/InsetClipping.java fails client-libs / 2d 0
JDK-8196019 4 java/awt/Window/Grab/GrabTest.java fails on Windows client-libs / java.awt 0
JDK-8198000 4 java/awt/List/EmptyListEventTest/EmptyListEventTest.java debug assert on Windows client-libs / java.awt 0
JDK-8198339 4 Test javax/swing/border/Test6981576.java is unstable client-libs / javax.swing 0
JDK-8198001 4 java/awt/Menu/WrongParentAfterRemoveMenu/WrongParentAfterRemoveMenu.java debug assert on Windows client-libs / java.awt 1
JDK-8200701 2 jdk/jshell/ExceptionsTest.java fails on Windows, after JDK-8198801 tools / jshell 0
JDK-8203672 3 JNI exception pending in PlainSocketImpl.c core-libs / java.net 1
JDK-8205399 4 Set node color on pinned HashMap.TreeNode deletion core-libs / java.util:collections 0
JDK-8204834 4 Fix confusing "allocate" naming in OopStorage hotspot / gc 0
JDK-8204551 4 Event descriptions are truncated in logs hotspot / runtime 0
JDK-8206179 4 com/sun/management/OperatingSystemMXBean/GetCommittedVirtualMemorySize.java fails with Committed virtual memory size illegal value core-svc / javax.management 1
JDK-8205653 3 test/jdk/sun/management/jmxremote/bootstrap/RmiRegistrySslTest.java and RmiSslBootstrapTest.sh fail with handshake_failure security-libs / javax.net.ssl 0
JDK-8208277 3 Code cache heap (-XX:ReservedCodeCacheSize) doesn't work with 1GB LargePages hotspot / compiler 0
JDK-8209534 3 [TESTBUG]runtime/appcds/cacheObject/ArchivedModuleCompareTest.java fails with EnableJVMCI hotspot / runtime 0
JDK-8209333 2 Socket reset issue for TLS 1.3 socket close security-libs / javax.net.ssl 0
JDK-8209439 3 C2 library_call can potentially ignore Math.pow intrinsic or use null pointer hotspot / compiler 0
JDK-8209113 3 Use WeakReference for lastFontStrike for created Fonts client-libs / 2d 0
JDK-8210284 2 "assert((av & 0x00000001) == 0) failed: unsupported V8" on Solaris 11.4 hotspot / compiler 0
JDK-8210147 3 adjust some WSAGetLastError usages in windows network coding core-libs / java.net 0
JDK-8210515 3 [TESTBUG]CheckArchivedModuleApp.java needs to check if EnableJVMCI is set hotspot / runtime 0
JDK-8210459 4 Add support for generating compile_commands.json infrastructure / build 0
JDK-8210303 3 VM_HandshakeAllThreads fails assert with "failed: blocked and not walkable" hotspot / runtime 0
JDK-8211301 3 [macos] support full window content options client-libs / java.awt 0
JDK-8210788 4 Javadoc for Thread.join(long, int) should specify that it waits forever when both arguments are zero core-libs / java.lang 0
JDK-8211392 2 compiler/profiling/spectrapredefineclass_classloaders/Launcher.java times out in JDK12 CI hotspot / compiler 0
JDK-8211743 3 [AOT] crash in ScopeDesc::decode_body() when JVMTI walks AOT frames hotspot / compiler 0
JDK-8211339 4 NPE during SSL handshake caused by HostnameChecker security-libs / javax.net.ssl 0
JDK-8211332 3 code_size2 (defined in stub_routines_x86.hpp) is too small on new Skylake CPUs hotspot / compiler 0
JDK-8212167 4 JShell : Stack trace of exception has wrong line number tools / jshell 0
JDK-8212154 4 [TESTBUG] CheckArchivedModuleApp fails with NPE when JVMCI is absent hotspot / runtime 0
JDK-8213250 3 CDS archive creation aborts due to metaspace object allocation failure hotspot / runtime 0
JDK-8212986 4 Make Visual Studio compiler check less strict infrastructure / build 1
JDK-8212933 3 Thread-SMR: requesting a VM operation whilst holding a ThreadsListHandle can cause deadlocks hotspot / runtime 0
JDK-8214444 4 Wrong strncat limits in dfa.cpp hotspot / compiler 0
JDK-8214440 3 ldap over a TLS connection negotiate failed with "javax.net.ssl.SSLPeerUnverifiedException: hostname of the server '' does not match the hostname in the server's certificate" core-libs / javax.naming 0
JDK-8213947 4 ARM32: failed check_simd should set UsePopCountInstruction to false hotspot / compiler 0
JDK-8214534 3 Setting of THIS_FILE in the build is broken infrastructure / build 0
JDK-8214481 3 freetype path does not disable TrueType hinting with AA+FM hints client-libs / 2d 0
JDK-8214571 2 -Xdoclint of array serialField gives "error: array type not allowed here" tools / javac 0
JDK-8214862 3 assert(proj != __null) at compile.cpp:3251 hotspot / compiler 0
JDK-8214856 3 Errors with JSZip in web console after upgrade to 3.1.5 tools / javadoc(tool) 0
JDK-8215369 2 JCStress pollute /var/tmp with temporary files. hotspot / test 0
JDK-8215711 3 Missing key_share extension for (EC)DHE key exchange should alert missing_extension security-libs / javax.net.ssl 0
JDK-8215555 3 TieredCompilation C2 threads can excessively block handshakes hotspot / compiler 0
JDK-8215551 4 Missing case label in nmethod::reloc_string_for() hotspot / compiler 0
JDK-8216154 4 C4819 warnings at HotSpot sources on Windows hotspot / compiler 0
JDK-8216151 3 [Graal] Module jdk.internal.vm.compiler.management has not been granted accessClassInPackage.org.graalvm.compiler.debug hotspot / compiler 0
JDK-8216541 2 CompiledICHolders of VM locked unloaded nmethods are released too late hotspot / compiler 0
JDK-8217230 2 assert(t == t_no_spec) failure in NodeHash::check_no_speculative_types() hotspot / compiler 0
JDK-8217728 4 Speed up incremental rerun of "make hotspot" infrastructure / build 0
JDK-8217606 2 LdapContext#reconnect always opens a new connection core-libs / javax.naming 0
JDK-8217447 4 Develop flag TraceICs is broken hotspot / compiler 0
JDK-8217404 4 --with-jvm-features doesn't work when multiple features are explicitly disabled infrastructure / build 0
JDK-8219597 4 (bf) Heap buffer state changes could provoke unexpected exceptions core-libs / java.nio 0
JDK-8219214 5 Infinite Loop in CodeSection::dump() hotspot / compiler 0
JDK-8218807 4 Compilation database (compile_commands.json) may contain obsolete items infrastructure / build 0
JDK-8219991 3 New fix of the deadlock in sun.security.ssl.SSLSocketImpl security-libs / javax.net.ssl 0
JDK-8219904 3 ClassCastException when calling FlightRecorderMXBean#getRecordings() hotspot / jfr 0
JDK-8220613 3 java/util/Arrays/TimSortStackSize2.java times out with fastdebug build core-libs / java.util 0
JDK-8221482 4 Initialize VMRegImpl::regName[] earlier to prevent assert during PrintStubCode hotspot / compiler 0
JDK-8221445 4 FastSysexMessage constructor crashes MIDI receiption thread client-libs / javax.sound 0
JDK-8221851 4 Use of THIS_FILE in hotspot invalidates precompiled header on Linux/GCC infrastructure / build 0
JDK-8221823 3 Requested JDialog width is ignored client-libs / java.awt 2
JDK-8221741 3 ClassCastException can happen when fontconfig.properties is used client-libs / java.awt 0
JDK-8223108 4 Test java/awt/EventQueue/NonComponentSourcePost.java is unstable client-libs / java.awt 0
JDK-8222264 2 Windows incremental build is broken with JDK-8217728 infrastructure / build 0
JDK-8223260 3 NamingManager should cache InitialContextFactory core-libs / javax.naming 0
JDK-8223678 4 Add Visual Studio Code workspace generation support (for native code) infrastructure / build 0
JDK-8223727 4 com/sun/jndi/ldap/privconn/RunTest.java failed due to hang in LdapRequest.getReplyBer core-libs / javax.naming 0
JDK-8223935 4 PIT: java/awt/font/WindowsIndicFonts.java fails on windows10 client-libs / 2d 0
JDK-8224475 3 JTextPane does not show images in HTML rendering client-libs / javax.swing 0
JDK-8224109 3 Text spaced incorrectly by drawString under rotation with fractional metrics client-libs / 2d 0
JDK-8224847 3 gc/stress/TestReclaimStringsLeaksMemory.java fails with reserved greater than expected hotspot / runtime 0
JDK-8224793 4 os::die() does not honor CreateCoredumpOnCrash option hotspot / runtime 0
JDK-8224632 4 testbug: java/awt/dnd/RemoveDropTargetCrashTest/RemoveDropTargetCrashTest.java fails on MacOS client-libs / java.awt 0
JDK-8224997 3 ChaCha20-Poly1305 TLS cipher suite decryption throws ShortBufferException security-libs / javax.net.ssl 0
JDK-8224931 2 disable JAOTC invokedynamic support until 8223533 is fixed hotspot / compiler 0
JDK-8225069 3 Remove Comodo root certificate that is expiring in May 2020 security-libs / java.security 0
JDK-8225068 3 Remove DocuSign root certificate that is expiring in May 2020 security-libs / java.security 0
JDK-8225130 4 Add exception for expiring Comodo roots to VerifyCACerts test security-libs / java.security 0
JDK-8225126 3 Test SetBoundsPaintTest.html failed on Windows when desktop is scaled client-libs / java.awt 0
JDK-8225325 4 Add tests for redefining a class' private method during resolution of the bootstrap specifier hotspot / jvmti 0
JDK-8225622 4 [AOT] runtime/SharedArchiveFile/TestInterpreterMethodEntries.java crashed with AOTed java.base hotspot / compiler 0
JDK-8225653 3 Provide more information when hitting SIGILL from HaltNode hotspot / compiler 0
JDK-8225789 2 Empty method parameter type should generate ClassFormatError hotspot / runtime 0
JDK-8225783 5 Incorrect use of binary operators on booleans in type.cpp hotspot / compiler 0
JDK-8226198 3 use of & instead of && in LibraryCallKit::arraycopy_restore_alloc_state hotspot / compiler 0
JDK-8226253 3 JAWS reports wrong number of radio buttons when buttons are hidden client-libs / javax.accessibility 0
JDK-8226806 4 [macOS 10.14] Methods of Java Robot should be called from appropriate thread client-libs / java.awt 0
JDK-8226879 4 Memory leak in Type::hashcons hotspot / compiler 0
JDK-8227324 3 Upgrade to freetype 2.10.1 client-libs / 2d 0
JDK-8227632 5 Incorrect PrintCompilation message: made not compilable on levels 0 1 2 3 4 hotspot / compiler 0
JDK-8228482 4 fix xlc16/xlclang comparison of distinct pointer types and string literal conversion warnings hotspot / runtime 0
JDK-8228407 2 JVM crashes with shared archive file mismatch hotspot / runtime 0
JDK-8228757 3 Fail fast if the handshake type is unknown security-libs / javax.net.ssl 0
JDK-8229158 4 make UseSwitchProfiling non-experimental or false by-default hotspot / compiler 0
JDK-8229421 4 The logic of java/net/ipv6tests/TcpTest.java is flawed core-libs / java.net 0
JDK-8229888 4 (zipfs) Updating an existing zip file does not preserve original permissions core-libs / java.nio 0
JDK-8229855 3 C2 fails with assert(false) failed: bad AD file hotspot / compiler 0
JDK-8230591 4 AArch64: Missing intrinsics for Math.ceil, floor, rint hotspot / compiler 0
JDK-8230597 2 Update GIFlib library to the 5.2.1 client-libs / java.awt 0
JDK-8230926 3 [macosx] Two apostrophes are entered instead of one with "U.S. International - PC" layout client-libs / java.awt 0
JDK-8231213 4 Migrate SimpleDateFormatConstTest to JDK Repo core-libs / java.text 0
JDK-8231118 2 ARM32: Math tests failures hotspot / compiler 0
JDK-8231243 5 [TESTBUG] CustomFont.java cannot find font file client-libs / 2d 0
JDK-8231438 3 [macOS] Dark mode for the desktop is not supported client-libs / java.awt 0
JDK-8231550 2 C2: ShouldNotReachHere() in verify_strip_mined_scheduling hotspot / compiler 0
JDK-8231572 3 Use -lobjc instead of -fobjc-link-runtime in libosxsecurity infrastructure / build 0
JDK-8231564 3 setMaximizedBounds is broken with large display scale and multiple monitors client-libs / java.awt 0
JDK-8231671 4 Fix copyright headers in hotspot (missing comma after year) hotspot / gc 0
JDK-8231631 4 sun/net/ftp/FtpURLConnectionLeak.java fails intermittently with NPE core-libs / java.net 0
JDK-8231810 3 javax/net/ssl/templates/SSLSocketSSLEngineTemplate.java fails intermittently with "java.lang.Exception: Unexpected EOF" security-libs / javax.net.ssl 0
JDK-8231779 3 crash HeapWord*ParallelScavengeHeap::failed_mem_allocate hotspot / gc 0
JDK-8231720 3 Some perf regressions after 8225653 hotspot / compiler 0
JDK-8231863 2 Crash if classpath is read from @argument file and the main gets option argument tools / launcher 0
JDK-8232080 3 jlink plugins for vendor information and command-line options tools / jlink 0
JDK-8232134 2 Change to Visual Studio 2017 15.9.16 for building on Windows at Oracle infrastructure / build 0
JDK-8232106 2 [x86] C2: SIGILL due to usage of SSSE3 instructions on processors which don't support it hotspot / compiler 0
JDK-8232200 3 [macos 10.15] Windows in fullscreen tests jumps around the screen client-libs / 2d 0
JDK-8232357 4 Compare version info of Santuario to legal notice security-libs / javax.xml.crypto 0
JDK-8232226 4 [macos 10.15] test/jdk/java/awt/color/EqualityTest/EqualityTest.java may fail client-libs / 2d 0
JDK-8232572 4 Add hooks for custom output dir in Bundles.gmk infrastructure / build 0
JDK-8232433 3 [macos 10.15] java/awt/Window/LocationAtScreenCorner/LocationAtScreenCorner.java may fail client-libs / java.awt 0
JDK-8232634 3 Problem List ICMColorDataTest.java client-libs / 2d 0
JDK-8232748 3 Build static versions of certain JDK libraries infrastructure / build 0
JDK-8232880 3 Update test documentation with additional settings for client UI tooltip tests infrastructure 0
JDK-8232846 4 ProcessHandle.Info command with non-English shows question marks core-libs / java.lang 0
JDK-8233033 2 C2 produces wrong result while unswitching a loop due to lost control dependencies hotspot / compiler 0
JDK-8233197 3 Invert JvmtiExport::post_vm_initialized() and Jfr:on_vm_start() start-up order for correct option parsing hotspot / jfr 0
JDK-8233137 2 runtime/ErrorHandling/VeryEarlyAssertTest.java fails after 8232080 hotspot / runtime 0
JDK-8233383 4 Various minor fixes infrastructure / build 0
JDK-8233364 4 Fix undefined behavior in Canonicalizer::do_ShiftOp hotspot / compiler 0
JDK-8233291 4 [TESTBUG] tools/jlink/plugins/VendorInfoPluginsTest.java fails with debug or non-server VMs tools / jlink 0
JDK-8233494 4 Avoid calling MallocTracker::record_malloc and record_free when NMT is off hotspot / runtime 0
JDK-8233608 2 Minimal build broken after JDK-8233494 hotspot / runtime 0
JDK-8233573 4 Toolkit.getScreenInsets(GraphicsConfiguration) may throw ClassCastException client-libs / java.awt 0
JDK-8233548 4 Update CUP to v0.11b xml / jaxp 0
JDK-8233649 4 Update ProblemList.txt to exclude failing headful tests on macos client-libs 0
JDK-8233621 3 Mismatch in jsse.enableMFLNExtension property name security-libs / javax.net.ssl 0
JDK-8233707 4 systemScale.cpp could not compile with VS2019 client-libs / java.awt 0
JDK-8233696 4 [TESTBUG]Some jtreg tests fail when CAPS_LOCK is ON client-libs 0
JDK-8234137 4 The "AutoTestOnTop.java" test may run external applications client-libs / java.awt 0
JDK-8233920 3 MethodHandles::tryFinally generates illegal bytecode for long/double return types core-libs / java.lang.invoke 0
JDK-8233880 3 Support compilers with multi-digit major version numbers infrastructure / build 0
JDK-8234184 4 [TESTBUG] java/awt/Mouse/EnterExitEvents/ModalDialogEnterExitEventsTest.java fails in Windows client-libs / java.awt 0
JDK-8234146 4 compiler/jsr292/ContinuousCallSiteTargetChange.java times out on SPARC hotspot / compiler 0
JDK-8234270 3 [REDO] JDK-8204128 NMT might report incorrect numbers for Compiler area hotspot / runtime 0
JDK-8234332 4 [TESTBUG] java/awt/Focus/DisposedWindow/DisposeDialogNotActivateOwnerTest/DisposeDialogNotActivateOwnerTest.java fails on linux-x64 nightly client-libs / java.awt 0
JDK-8234398 3 Replace ID2D1Factory::GetDesktopDpi with GetDeviceCaps client-libs / 2d 0
JDK-8234522 2 [macos] Crash with use of native file dialog client-libs / java.awt 0
JDK-8234723 4 javax/net/ssl/TLS tests support TLSv1.3 security-libs / javax.net.ssl 0
JDK-8234691 3 Potential double-free in ParallelSPCleanupTask constructor hotspot / runtime 0
JDK-8234696 3 tools/jlink/plugins/VendorInfoPluginsTest.java times out tools / jlink 0
JDK-8234728 4 Some security tests should support TLSv1.3 security-libs / javax.net.ssl 0
JDK-8234727 4 sun/security/ssl/X509TrustManagerImpl tests support TLSv1.3 security-libs / javax.net.ssl 0
JDK-8234724 4 javax/net/ssl/templates/SSLSocketSSLEngineTemplate.java supports TLSv1.3 security-libs / javax.net.ssl 0
JDK-8234779 4 Provide idiom for declaring classes noncopyable hotspot / runtime 0
JDK-8234769 3 Duplicate attribution in freetype.md client-libs / 2d 0
JDK-8235183 4 Remove the \"HACK CODE\" in comment security-libs / java.security 0
JDK-8235153 3 [TESTBUG] [macos 10.15] java/awt/Graphics/DrawImageBG/SystemBgColorTest.java fails client-libs / java.awt 0
JDK-8234968 4 check calloc rv in libinstrument InvocationAdapter core-svc / java.lang.instrument 0
JDK-8234824 3 java/nio/channels/SocketChannel/AdaptSocket.java fails on Windows 10 core-libs / java.nio 0
JDK-8235263 3 Revert TLS 1.3 change that wrapped IOExceptions security-libs / javax.net.ssl 0
JDK-8235311 4 Tag mismatch may alert bad_record_mac security-libs / javax.net.ssl 0
JDK-8235332 3 TestInstanceCloneAsLoadsStores.java fails with -XX:+StressGCM hotspot / compiler 0
JDK-8235452 2 Strip mined loop verification fails with assert(is_OuterStripMinedLoop()) failed: invalid node class hotspot / compiler 0
JDK-8235584 3 UseProfiledLoopPredicate fails with assert(_phase->get_loop(c) == loop) failed: have to be in the same loop hotspot / compiler 0
JDK-8235563 4 [TESTBUG] appcds/CommandLineFlagComboNegative.java does not handle archive mapping failure hotspot / runtime 0
JDK-8235638 3 NPE in LWWindowPeer.getOnscreenGraphics() client-libs 0
JDK-8235620 3 Broken merge between JDK-8006406 and JDK-8003559 client-libs / java.awt 0
JDK-8235739 4 Rare NPE at WComponentPeer.getGraphics() client-libs / java.awt 0
JDK-8235686 2 Add more custom hooks in Bundles.gmk infrastructure / build 0
JDK-8235762 3 JVM crash in SWPointer during C2 compilation hotspot / compiler 0
JDK-8235834 3 IBM-943 charset encoder needs updating core-libs / java.nio.charsets 0
JDK-8235874 3 The ordering of Cipher Suites is not maintained provided through “jdk.tls.client.cipherSuites” and “jdk.tls.server.cipherSuites” system property. security-libs / javax.net.ssl 0
JDK-8235908 4 omit ThreadPriorityPolicy warning when value is set from image hotspot / runtime 0
JDK-8235984 2 C2: assert(out->in(PhiNode::Region) == head || out->in(PhiNode::Region) == slow_head) failed: phi must be either part of the slow or the fast loop hotspot / compiler 0
JDK-8236211 3 [Graal] compiler/graalunit/GraphTest.java is skipped in all testing hotspot / compiler 0
JDK-8236470 3 Deal with ECDSA using ecdsa-with-SHA2 plus hash algorithm as AlgorithmId security-libs / java.security 0
JDK-8236545 4 Compilation error in mach5 java/awt/FileDialog/MacOSGoToFolderCrash.java client-libs / java.awt 0
JDK-8236700 3 Upgrading JSZip from v3.1.5 to v3.2.2 tools / javadoc(tool) 0
JDK-8236759 3 ShouldNotReachHere in PhaseIdealLoop::verify_strip_mined_scheduling hotspot / compiler 0
JDK-8236897 4 Fix the copyright header for pkcs11gcm2.h security-libs / javax.crypto:pkcs11 0
JDK-8236921 4 Add build target to produce a JDK image suitable for a Graal/SVM build infrastructure / build 0
JDK-8236953 2 [macos] JavaFX SwingNode is not rendered on macOS client-libs / javax.swing 0
JDK-8236996 4 Incorrect Roboto font rendering on Windows with subpixel antialiasing client-libs / 2d 0
JDK-8237045 3 JVM uses excessive memory with -XX:+EnableJVMCI -XX:JVMCICounterSize=2147483648 hotspot / compiler 0
JDK-8237055 3 [TESTBUG] compiler/c2/TestJumpTable.java fails with release VMs hotspot / compiler 0
JDK-8237086 3 assert(is_MachReturn()) running CTW with fix for JDK-8231291 hotspot / compiler 0
JDK-8237192 3 Generate stripped/public pdbs on Windows for jdk images infrastructure / build 0
JDK-8237396 2 JvmtiTagMap::weak_oops_do() should not trigger barriers hotspot / gc 0
JDK-8237474 2 Default SSLEngine should create in server role security-libs / javax.net.ssl 0
JDK-8237859 2 C2: Crash when loads float above range check hotspot / compiler 0
JDK-8237879 3 make 4.3 breaks build infrastructure / build 0
JDK-8237951 4 CTW: C2 compilation fails with \"malformed control flow\" hotspot / compiler 0
JDK-8237962 4 give better error output for invalid OCSP response intervals in CertPathValidator checks security-libs / java.security 0
JDK-8238190 4 [JVMCI] Fix single implementor speculation for diamond shapes. hotspot / compiler 0
JDK-8238356 3 CodeHeap::blob_count() overestimates the number of blobs hotspot / compiler 0
JDK-8238438 3 SuperWord::co_locate_pack picks memory state of first instead of last load hotspot / compiler 0
JDK-8238452 3 Keytool generates wrong expiration date if validity is set to 2050/01/01 security-libs / java.security 0
JDK-8238555 4 Allow initialization of SunPKCS11 with NSS when there are external FIPS modules in the NSSDB security-libs / javax.crypto:pkcs11 0
JDK-8238575 3 DragSourceEvent.getLocation() returns wrong value on HiDPI screens (Windows) client-libs / java.awt 0
JDK-8238676 3 jni crashes on accessing it from process exit hook hotspot / runtime 0
JDK-8238721 4 Add failing client jtreg tests to the Problem List client-libs 0
JDK-8238738 4 AudioSystem.getMixerInfo() takes about 30 sec to report a gone audio device client-libs / javax.sound 0
JDK-8238756 4 C2: assert(((n) == __null || !VerifyIterativeGVN || !((n)->is_dead()))) failed: can not use dead node hotspot / compiler 0
JDK-8238765 3 PhaseCFG::schedule_pinned_nodes cannot handle precedence edges from unmatched CFG nodes correctly hotspot / compiler 0
JDK-8238842 3 AIOOBE in GIFImageReader.initializeStringTable client-libs / javax.imageio 0
JDK-8238898 2 Missing hash characters for header on license file security-libs / javax.crypto:pkcs11 0
JDK-8238942 3 Rendering artifacts with LCD text and fractional metrics client-libs / 2d 0
JDK-8238985 4 [TESTBUG] The arrow image is blue instead of green client-libs / javax.swing 0
JDK-8239000 4 handle ContendedPaddingWidth in vm_version_ppc hotspot / runtime 0
JDK-8239055 4 Wrong implementation of VMState.hasListener core-svc / debugger 0
JDK-8239091 4 Reversed arguments in call to strstr in freetype \"debug\" code. client-libs / 2d 0
JDK-8239142 3 C2\'s UseUniqueSubclasses optimization is broken for array accesses hotspot / compiler 0
JDK-8239224 4 libproc_impl.c previous_thr may be used uninitialized warning hotspot / svc-agent 0
JDK-8239351 3 Give more meaningful InternalError messages in Deflater.c core-libs / java.util.jar 0
JDK-8239365 4 ProcessBuilder test modifications for AIX execution core-libs / java.lang 0
JDK-8239456 4 [win][x86] vtable stub generation: assert failure (code size estimate) hotspot / compiler 0
JDK-8239457 3 call ReleaseStringUTFChars before early returns in Java_sun_security_pkcs11_wrapper_PKCS11_connect security-libs / javax.crypto:pkcs11 0
JDK-8239462 4 jdk.hotspot.agent misses some ReleaseStringUTFChars calls in case of early returns hotspot / svc-agent 0
JDK-8239557 4 [TESTBUG] VeryEarlyAssertTest.java validating \"END.\" marker at lastline is not always true hotspot / runtime 0
JDK-8239787 3 AArch64: String.indexOf may incorrectly handle empty strings. hotspot / runtime 0
JDK-8239792 4 Bump update version for OpenJDK: jdk-11.0.8 infrastructure 0
JDK-8239798 2 SSLSocket closes socket both socket endpoints on a SocketTimeoutException security-libs / javax.net.ssl 0
JDK-8239819 4 XToolkit: Misread of screen information memory client-libs / java.awt 0
JDK-8239852 3 java/util/concurrent tests fail with -XX:+VerifyGraphEdges: assert(!VerifyGraphEdges) failed: verification should have failed hotspot / compiler 0
JDK-8239856 4 [ntintel] asserts about copying unaligned array element core-svc / debugger 0
JDK-8239893 3 Windows handle Leak when starting processes using ProcessBuilder core-libs / java.lang 0
JDK-8239915 4 Zero VM crashes when handling dynamic constant hotspot / runtime 0
JDK-8239931 4 [win][x86] vtable stub generation: assert failure (code size estimate) follow-up hotspot / compiler 0
JDK-8239965 4 XMLEncoder/Test4625418.java fails due to \"Error: Cp943 - can\'t read properly\" core-libs / java.nio.charsets 0
JDK-8239976 4 Put JDK-8239965 on the ProblemList.txt core-libs / java.nio.charsets 0
JDK-8240073 4 Fix \'test-make\' build target in 11u infrastructure / build 0
JDK-8240202 4 A few client tests leave mouse buttons pressed client-libs / javax.swing 0
JDK-8240197 3 Cannot start JVM when $JAVA_HOME includes CJK characters hotspot / runtime 0
JDK-8240220 4 IdealLoopTree::dump_head predicate printing is broken hotspot / compiler 0
JDK-8240223 4 Use consistent predicate order in and with PhaseIdealLoop::find_predicate hotspot / compiler 0
JDK-8240227 2 Loop predicates should be copied to unswitched loops hotspot / compiler 0
JDK-8240286 4 [TESTBUG] Test command error in hotspot/jtreg/compiler/loopopts/superword/SumRedAbsNeg_Float.java hotspot / test 0
JDK-8240518 4 Incorrect JNU_ReleaseStringPlatformChars in Windows Print client-libs / java.awt 0
JDK-8240529 3 CheckUnhandledOops breaks NULL check in Modules::define_module hotspot / runtime 0
JDK-8240576 2 JVM crashes after transformation in C2 IdealLoopTree::merge_many_backedges hotspot / compiler 0
JDK-8240603 3 Windows 32bit compile error after 8238676 hotspot / runtime 0
JDK-8240629 3 argfiles parsing broken for argfiles with comment cross 4096 bytes chunk tools / launcher 0
JDK-8240711 4 TestJstatdPort.java failed due to "ExportException: Port already in use:" core-svc / tools 0
JDK-8240724 4 [test] jdk11 downport of 8224475 misses binary file test/jdk/javax/swing/JTextPane/arrow.png client-libs / javax.swing 0
JDK-8240786 4 [TESTBUG] The test java/awt/Window/GetScreenLocation/GetScreenLocationTest.java fails on HiDPI screen client-libs / java.awt 0
JDK-8240824 3 enhance print_full_memory_info on Linux by THP related information hotspot / runtime 0
JDK-8240827 4 Downport SSLSocketImpl.java from "8221882: Use fiber-friendly java.util.concurrent.locks in JSSE" security-libs / javax.net.ssl 0
JDK-8240905 3 assert(mem == (Node*)1 || mem == mem2) failed: multiple Memories being matched at once? hotspot / compiler 0
JDK-8240972 4 macOS codesign fail on macOS 10.13.5 or older infrastructure / build 0
JDK-8241296 2 Segfault in JNIHandleBlock::oops_do() hotspot / runtime 0
JDK-8241445 4 Fix copyrights after JDK-8240629 change tools / launcher 0
JDK-8241458 4 [JVMCI] add mark value to expose CodeOffsets::Frame_Complete hotspot / compiler 0
JDK-8241464 4 [11u] Backport: make rehashing be a needed guaranteed safepoint cleanup action hotspot / runtime 0
JDK-8241556 2 Memory leak if -XX:CompileCommand is set hotspot / compiler 0
JDK-8241568 4 (fs) UserPrincipalLookupService.lookupXXX failure with IOE "Operation not permitted" core-libs / java.nio 0
JDK-8241586 4 compiler/cpuflags/TestAESIntrinsicsOnUnsupportedConfig.java fails on aarch64 hotspot / runtime 0
JDK-8241638 4 launcher time metrics always report 1 on Linux when _JAVA_LAUNCHER_DEBUG set tools / launcher 0
JDK-8241660 4 Add virtualization information output to hs_err file on macOS hotspot / runtime 0
JDK-8241808 4 [TESTBUG] The JDK-8039467 bug appeared on macOS client-libs / java.awt 0
JDK-8241888 4 Mirror jdk.security.allowNonCaAnchor system property with a security one security-libs / jdk.security 0
JDK-8241900 2 Loop unswitching may cause dependence on null check to be lost hotspot / compiler 0
JDK-8241948 4 enhance list of environment variables printed in hs_err file hotspot / runtime 0
JDK-8241996 3 on linux set full relro in the linker flags infrastructure / build 0
JDK-8242108 3 Performance regression after fix for JDK-8229496 hotspot / compiler 0
JDK-8242141 3 New System Properties to configure the TLS signature schemes security-libs / javax.net.ssl 0
JDK-8242154 4 Backport parts of JDK-4947890 to OpenJDK 11u core-libs / java.lang 0
JDK-8242174 2 [macos] The NestedModelessDialogTest test make the macOS unstable client-libs / java.awt 0
JDK-8242239 3 [Graal] javax/management/generified/GenericTest.java fails: FAILED: queryMBeans sets same core-svc / javax.management 0
JDK-8242294 3 JSSE Client does not throw SSLException when an alert occurs during handshaking security-libs / javax.net.ssl 0
JDK-8242379 4 [TESTBUG] compiler/loopopts/TestLoopUnswitchingLostCastDependency.java fails with release VMs hotspot / compiler 0
JDK-8242470 4 Update Xerces to Version 2.12.1 xml / jaxp 0
JDK-8242498 2 Invalid "sun.awt.TimedWindowEvent" object leads to JVM crash client-libs / java.awt 0
JDK-8242541 3 Small charset issues (ISO8859-16, x-eucJP-Open, x-IBM834 and x-IBM949C) core-libs / java.nio.charsets 0
JDK-8242626 4 enhance posix print_rlimit_info hotspot / runtime 0
JDK-8243059 3 Build fails when --with-vendor-name contains a comma infrastructure / build 0
JDK-8243539 4 Copyright info (Year) should be updated for fix of 8241638 core-libs 0
JDK-8243541 3 (tz) Upgrade time-zone data to tzdata2020a core-libs / java.time 0
JDK-8244407 2 JVM crashes after transformation in C2 IdealLoopTree::split_fall_in hotspot / compiler 0
JDK-8244520 4 problemlist java/awt/font/Rotate/RotatedFontTest.java on linux client-libs / 2d 0
JDK-8244777 4 ClassLoaderStats VM Op uses constant hash value hotspot / jfr 0
JDK-8244853 3 The static build of libextnet is missing the JNI_OnLoad_extnet function core-libs / java.net 0
JDK-8244951 2 Missing entitlements for hardened runtime infrastructure / build 0
JDK-8245047 2 [PPC64] C2: ReverseBytes + Load always match to unordered Load (acquire semantics missing) hotspot / compiler 0
JDK-8245649 3 Revert 8245397 backport of 8230591 hotspot / compiler 0
JDK-8246031 3 SSLSocket.getSession() doesn't close connection for timeout/ interrupts security-libs / javax.net.ssl 0
JDK-8246613 3 Choose the default SecureRandom algo based on registration ordering security-libs / java.security 0

This section organizes the changes in the selected update release by the main component under which each issue is filed.

Core Libs (33)

Issue
Priority
Title
Component
Voting
JDK-8044365 4 (dc) MulticastSendReceiveTests.java failing with ENOMEM when joining group (OS X 10.9) core-libs / java.nio 0
JDK-8146090 3 java/lang/ref/ReachabilityFenceTest.java fails with -XX:+DeoptimizeALot core-libs / java.lang 0
JDK-8183369 3 RFC unconformity of HttpURLConnection with proxy core-libs / java.net 0
JDK-8191169 4 java/net/Authenticator/B4769350.java failed intermittently core-libs / java.net 0
JDK-8203672 3 JNI exception pending in PlainSocketImpl.c core-libs / java.net 1
JDK-8205399 4 Set node color on pinned HashMap.TreeNode deletion core-libs / java.util:collections 0
JDK-8210147 3 adjust some WSAGetLastError usages in windows network coding core-libs / java.net 0
JDK-8210788 4 Javadoc for Thread.join(long, int) should specify that it waits forever when both arguments are zero core-libs / java.lang 0
JDK-8214440 3 ldap over a TLS connection negotiate failed with "javax.net.ssl.SSLPeerUnverifiedException: hostname of the server '' does not match the hostname in the server's certificate" core-libs / javax.naming 0
JDK-8217606 2 LdapContext#reconnect always opens a new connection core-libs / javax.naming 0
JDK-8219597 4 (bf) Heap buffer state changes could provoke unexpected exceptions core-libs / java.nio 0
JDK-8220613 3 java/util/Arrays/TimSortStackSize2.java times out with fastdebug build core-libs / java.util 0
JDK-8223260 3 NamingManager should cache InitialContextFactory core-libs / javax.naming 0
JDK-8223727 4 com/sun/jndi/ldap/privconn/RunTest.java failed due to hang in LdapRequest.getReplyBer core-libs / javax.naming 0
JDK-8229421 4 The logic of java/net/ipv6tests/TcpTest.java is flawed core-libs / java.net 0
JDK-8229888 4 (zipfs) Updating an existing zip file does not preserve original permissions core-libs / java.nio 0
JDK-8231213 4 Migrate SimpleDateFormatConstTest to JDK Repo core-libs / java.text 0
JDK-8231631 4 sun/net/ftp/FtpURLConnectionLeak.java fails intermittently with NPE core-libs / java.net 0
JDK-8232846 4 ProcessHandle.Info command with non-English shows question marks core-libs / java.lang 0
JDK-8233920 3 MethodHandles::tryFinally generates illegal bytecode for long/double return types core-libs / java.lang.invoke 0
JDK-8234824 3 java/nio/channels/SocketChannel/AdaptSocket.java fails on Windows 10 core-libs / java.nio 0
JDK-8235834 3 IBM-943 charset encoder needs updating core-libs / java.nio.charsets 0
JDK-8239351 3 Give more meaningful InternalError messages in Deflater.c core-libs / java.util.jar 0
JDK-8239365 4 ProcessBuilder test modifications for AIX execution core-libs / java.lang 0
JDK-8239893 3 Windows handle Leak when starting processes using ProcessBuilder core-libs / java.lang 0
JDK-8239965 4 XMLEncoder/Test4625418.java fails due to \"Error: Cp943 - can\'t read properly\" core-libs / java.nio.charsets 0
JDK-8239976 4 Put JDK-8239965 on the ProblemList.txt core-libs / java.nio.charsets 0
JDK-8241568 4 (fs) UserPrincipalLookupService.lookupXXX failure with IOE "Operation not permitted" core-libs / java.nio 0
JDK-8242154 4 Backport parts of JDK-4947890 to OpenJDK 11u core-libs / java.lang 0
JDK-8242541 3 Small charset issues (ISO8859-16, x-eucJP-Open, x-IBM834 and x-IBM949C) core-libs / java.nio.charsets 0
JDK-8243539 4 Copyright info (Year) should be updated for fix of 8241638 core-libs 0
JDK-8243541 3 (tz) Upgrade time-zone data to tzdata2020a core-libs / java.time 0
JDK-8244853 3 The static build of libextnet is missing the JNI_OnLoad_extnet function core-libs / java.net 0

Security Libs (36)

Issue
Priority
Title
Component
Voting
JDK-8205653 3 test/jdk/sun/management/jmxremote/bootstrap/RmiRegistrySslTest.java and RmiSslBootstrapTest.sh fail with handshake_failure security-libs / javax.net.ssl 0
JDK-8209333 2 Socket reset issue for TLS 1.3 socket close security-libs / javax.net.ssl 0
JDK-8211339 4 NPE during SSL handshake caused by HostnameChecker security-libs / javax.net.ssl 0
JDK-8215711 3 Missing key_share extension for (EC)DHE key exchange should alert missing_extension security-libs / javax.net.ssl 0
JDK-8219991 3 New fix of the deadlock in sun.security.ssl.SSLSocketImpl security-libs / javax.net.ssl 0
JDK-8224997 3 ChaCha20-Poly1305 TLS cipher suite decryption throws ShortBufferException security-libs / javax.net.ssl 0
JDK-8225069 3 Remove Comodo root certificate that is expiring in May 2020 security-libs / java.security 0
JDK-8225068 3 Remove DocuSign root certificate that is expiring in May 2020 security-libs / java.security 0
JDK-8225130 4 Add exception for expiring Comodo roots to VerifyCACerts test security-libs / java.security 0
JDK-8228757 3 Fail fast if the handshake type is unknown security-libs / javax.net.ssl 0
JDK-8231810 3 javax/net/ssl/templates/SSLSocketSSLEngineTemplate.java fails intermittently with "java.lang.Exception: Unexpected EOF" security-libs / javax.net.ssl 0
JDK-8232357 4 Compare version info of Santuario to legal notice security-libs / javax.xml.crypto 0
JDK-8233621 3 Mismatch in jsse.enableMFLNExtension property name security-libs / javax.net.ssl 0
JDK-8234723 4 javax/net/ssl/TLS tests support TLSv1.3 security-libs / javax.net.ssl 0
JDK-8234728 4 Some security tests should support TLSv1.3 security-libs / javax.net.ssl 0
JDK-8234727 4 sun/security/ssl/X509TrustManagerImpl tests support TLSv1.3 security-libs / javax.net.ssl 0
JDK-8234724 4 javax/net/ssl/templates/SSLSocketSSLEngineTemplate.java supports TLSv1.3 security-libs / javax.net.ssl 0
JDK-8235183 4 Remove the \"HACK CODE\" in comment security-libs / java.security 0
JDK-8235263 3 Revert TLS 1.3 change that wrapped IOExceptions security-libs / javax.net.ssl 0
JDK-8235311 4 Tag mismatch may alert bad_record_mac security-libs / javax.net.ssl 0
JDK-8235874 3 The ordering of Cipher Suites is not maintained provided through “jdk.tls.client.cipherSuites” and “jdk.tls.server.cipherSuites” system property. security-libs / javax.net.ssl 0
JDK-8236470 3 Deal with ECDSA using ecdsa-with-SHA2 plus hash algorithm as AlgorithmId security-libs / java.security 0
JDK-8236897 4 Fix the copyright header for pkcs11gcm2.h security-libs / javax.crypto:pkcs11 0
JDK-8237474 2 Default SSLEngine should create in server role security-libs / javax.net.ssl 0
JDK-8237962 4 give better error output for invalid OCSP response intervals in CertPathValidator checks security-libs / java.security 0
JDK-8238452 3 Keytool generates wrong expiration date if validity is set to 2050/01/01 security-libs / java.security 0
JDK-8238555 4 Allow initialization of SunPKCS11 with NSS when there are external FIPS modules in the NSSDB security-libs / javax.crypto:pkcs11 0
JDK-8238898 2 Missing hash characters for header on license file security-libs / javax.crypto:pkcs11 0
JDK-8239457 3 call ReleaseStringUTFChars before early returns in Java_sun_security_pkcs11_wrapper_PKCS11_connect security-libs / javax.crypto:pkcs11 0
JDK-8239798 2 SSLSocket closes socket both socket endpoints on a SocketTimeoutException security-libs / javax.net.ssl 0
JDK-8240827 4 Downport SSLSocketImpl.java from "8221882: Use fiber-friendly java.util.concurrent.locks in JSSE" security-libs / javax.net.ssl 0
JDK-8241888 4 Mirror jdk.security.allowNonCaAnchor system property with a security one security-libs / jdk.security 0
JDK-8242141 3 New System Properties to configure the TLS signature schemes security-libs / javax.net.ssl 0
JDK-8242294 3 JSSE Client does not throw SSLException when an alert occurs during handshaking security-libs / javax.net.ssl 0
JDK-8246031 3 SSLSocket.getSession() doesn't close connection for timeout/ interrupts security-libs / javax.net.ssl 0
JDK-8246613 3 Choose the default SecureRandom algo based on registration ordering security-libs / java.security 0

Hotspot (122)

Issue
Priority
Title
Component
Voting
JDK-8022574 4 remove HaltNode code after uncommon trap calls hotspot / compiler 1
JDK-8051349 4 nsk/jvmti/scenarios/sampling/SP06/sp06t003 fails in nightly hotspot / jvmti 0
JDK-8139876 3 Exclude hanging nsk/stress/stack from execution with deoptimization enabled hotspot / runtime 0
JDK-8156207 5 Resource allocated BitMaps are often cleared unnecessarily hotspot / compiler 0
JDK-8187078 4 -XX:+VerifyOops finds numerous problems when running JPRT hotspot / compiler 0
JDK-8191930 5 [Graal] emits unparseable XML into compile log hotspot / compiler 0
JDK-8204834 4 Fix confusing "allocate" naming in OopStorage hotspot / gc 0
JDK-8204551 4 Event descriptions are truncated in logs hotspot / runtime 0
JDK-8208277 3 Code cache heap (-XX:ReservedCodeCacheSize) doesn't work with 1GB LargePages hotspot / compiler 0
JDK-8209534 3 [TESTBUG]runtime/appcds/cacheObject/ArchivedModuleCompareTest.java fails with EnableJVMCI hotspot / runtime 0
JDK-8209439 3 C2 library_call can potentially ignore Math.pow intrinsic or use null pointer hotspot / compiler 0
JDK-8210284 2 "assert((av & 0x00000001) == 0) failed: unsupported V8" on Solaris 11.4 hotspot / compiler 0
JDK-8210515 3 [TESTBUG]CheckArchivedModuleApp.java needs to check if EnableJVMCI is set hotspot / runtime 0
JDK-8210303 3 VM_HandshakeAllThreads fails assert with "failed: blocked and not walkable" hotspot / runtime 0
JDK-8211392 2 compiler/profiling/spectrapredefineclass_classloaders/Launcher.java times out in JDK12 CI hotspot / compiler 0
JDK-8211743 3 [AOT] crash in ScopeDesc::decode_body() when JVMTI walks AOT frames hotspot / compiler 0
JDK-8211332 3 code_size2 (defined in stub_routines_x86.hpp) is too small on new Skylake CPUs hotspot / compiler 0
JDK-8212154 4 [TESTBUG] CheckArchivedModuleApp fails with NPE when JVMCI is absent hotspot / runtime 0
JDK-8213250 3 CDS archive creation aborts due to metaspace object allocation failure hotspot / runtime 0
JDK-8212933 3 Thread-SMR: requesting a VM operation whilst holding a ThreadsListHandle can cause deadlocks hotspot / runtime 0
JDK-8214444 4 Wrong strncat limits in dfa.cpp hotspot / compiler 0
JDK-8213947 4 ARM32: failed check_simd should set UsePopCountInstruction to false hotspot / compiler 0
JDK-8214862 3 assert(proj != __null) at compile.cpp:3251 hotspot / compiler 0
JDK-8215369 2 JCStress pollute /var/tmp with temporary files. hotspot / test 0
JDK-8215555 3 TieredCompilation C2 threads can excessively block handshakes hotspot / compiler 0
JDK-8215551 4 Missing case label in nmethod::reloc_string_for() hotspot / compiler 0
JDK-8216154 4 C4819 warnings at HotSpot sources on Windows hotspot / compiler 0
JDK-8216151 3 [Graal] Module jdk.internal.vm.compiler.management has not been granted accessClassInPackage.org.graalvm.compiler.debug hotspot / compiler 0
JDK-8216541 2 CompiledICHolders of VM locked unloaded nmethods are released too late hotspot / compiler 0
JDK-8217230 2 assert(t == t_no_spec) failure in NodeHash::check_no_speculative_types() hotspot / compiler 0
JDK-8217447 4 Develop flag TraceICs is broken hotspot / compiler 0
JDK-8219214 5 Infinite Loop in CodeSection::dump() hotspot / compiler 0
JDK-8219904 3 ClassCastException when calling FlightRecorderMXBean#getRecordings() hotspot / jfr 0
JDK-8221482 4 Initialize VMRegImpl::regName[] earlier to prevent assert during PrintStubCode hotspot / compiler 0
JDK-8224847 3 gc/stress/TestReclaimStringsLeaksMemory.java fails with reserved greater than expected hotspot / runtime 0
JDK-8224793 4 os::die() does not honor CreateCoredumpOnCrash option hotspot / runtime 0
JDK-8224931 2 disable JAOTC invokedynamic support until 8223533 is fixed hotspot / compiler 0
JDK-8225325 4 Add tests for redefining a class' private method during resolution of the bootstrap specifier hotspot / jvmti 0
JDK-8225622 4 [AOT] runtime/SharedArchiveFile/TestInterpreterMethodEntries.java crashed with AOTed java.base hotspot / compiler 0
JDK-8225653 3 Provide more information when hitting SIGILL from HaltNode hotspot / compiler 0
JDK-8225789 2 Empty method parameter type should generate ClassFormatError hotspot / runtime 0
JDK-8225783 5 Incorrect use of binary operators on booleans in type.cpp hotspot / compiler 0
JDK-8226198 3 use of & instead of && in LibraryCallKit::arraycopy_restore_alloc_state hotspot / compiler 0
JDK-8226879 4 Memory leak in Type::hashcons hotspot / compiler 0
JDK-8227632 5 Incorrect PrintCompilation message: made not compilable on levels 0 1 2 3 4 hotspot / compiler 0
JDK-8228482 4 fix xlc16/xlclang comparison of distinct pointer types and string literal conversion warnings hotspot / runtime 0
JDK-8228407 2 JVM crashes with shared archive file mismatch hotspot / runtime 0
JDK-8229158 4 make UseSwitchProfiling non-experimental or false by-default hotspot / compiler 0
JDK-8229855 3 C2 fails with assert(false) failed: bad AD file hotspot / compiler 0
JDK-8230591 4 AArch64: Missing intrinsics for Math.ceil, floor, rint hotspot / compiler 0
JDK-8231118 2 ARM32: Math tests failures hotspot / compiler 0
JDK-8231550 2 C2: ShouldNotReachHere() in verify_strip_mined_scheduling hotspot / compiler 0
JDK-8231671 4 Fix copyright headers in hotspot (missing comma after year) hotspot / gc 0
JDK-8231779 3 crash HeapWord*ParallelScavengeHeap::failed_mem_allocate hotspot / gc 0
JDK-8231720 3 Some perf regressions after 8225653 hotspot / compiler 0
JDK-8232106 2 [x86] C2: SIGILL due to usage of SSSE3 instructions on processors which don't support it hotspot / compiler 0
JDK-8233033 2 C2 produces wrong result while unswitching a loop due to lost control dependencies hotspot / compiler 0
JDK-8233197 3 Invert JvmtiExport::post_vm_initialized() and Jfr:on_vm_start() start-up order for correct option parsing hotspot / jfr 0
JDK-8233137 2 runtime/ErrorHandling/VeryEarlyAssertTest.java fails after 8232080 hotspot / runtime 0
JDK-8233364 4 Fix undefined behavior in Canonicalizer::do_ShiftOp hotspot / compiler 0
JDK-8233494 4 Avoid calling MallocTracker::record_malloc and record_free when NMT is off hotspot / runtime 0
JDK-8233608 2 Minimal build broken after JDK-8233494 hotspot / runtime 0
JDK-8234146 4 compiler/jsr292/ContinuousCallSiteTargetChange.java times out on SPARC hotspot / compiler 0
JDK-8234270 3 [REDO] JDK-8204128 NMT might report incorrect numbers for Compiler area hotspot / runtime 0
JDK-8234691 3 Potential double-free in ParallelSPCleanupTask constructor hotspot / runtime 0
JDK-8234779 4 Provide idiom for declaring classes noncopyable hotspot / runtime 0
JDK-8235332 3 TestInstanceCloneAsLoadsStores.java fails with -XX:+StressGCM hotspot / compiler 0
JDK-8235452 2 Strip mined loop verification fails with assert(is_OuterStripMinedLoop()) failed: invalid node class hotspot / compiler 0
JDK-8235584 3 UseProfiledLoopPredicate fails with assert(_phase->get_loop(c) == loop) failed: have to be in the same loop hotspot / compiler 0
JDK-8235563 4 [TESTBUG] appcds/CommandLineFlagComboNegative.java does not handle archive mapping failure hotspot / runtime 0
JDK-8235762 3 JVM crash in SWPointer during C2 compilation hotspot / compiler 0
JDK-8235908 4 omit ThreadPriorityPolicy warning when value is set from image hotspot / runtime 0
JDK-8235984 2 C2: assert(out->in(PhiNode::Region) == head || out->in(PhiNode::Region) == slow_head) failed: phi must be either part of the slow or the fast loop hotspot / compiler 0
JDK-8236211 3 [Graal] compiler/graalunit/GraphTest.java is skipped in all testing hotspot / compiler 0
JDK-8236759 3 ShouldNotReachHere in PhaseIdealLoop::verify_strip_mined_scheduling hotspot / compiler 0
JDK-8237045 3 JVM uses excessive memory with -XX:+EnableJVMCI -XX:JVMCICounterSize=2147483648 hotspot / compiler 0
JDK-8237055 3 [TESTBUG] compiler/c2/TestJumpTable.java fails with release VMs hotspot / compiler 0
JDK-8237086 3 assert(is_MachReturn()) running CTW with fix for JDK-8231291 hotspot / compiler 0
JDK-8237396 2 JvmtiTagMap::weak_oops_do() should not trigger barriers hotspot / gc 0
JDK-8237859 2 C2: Crash when loads float above range check hotspot / compiler 0
JDK-8237951 4 CTW: C2 compilation fails with \"malformed control flow\" hotspot / compiler 0
JDK-8238190 4 [JVMCI] Fix single implementor speculation for diamond shapes. hotspot / compiler 0
JDK-8238356 3 CodeHeap::blob_count() overestimates the number of blobs hotspot / compiler 0
JDK-8238438 3 SuperWord::co_locate_pack picks memory state of first instead of last load hotspot / compiler 0
JDK-8238676 3 jni crashes on accessing it from process exit hook hotspot / runtime 0
JDK-8238756 4 C2: assert(((n) == __null || !VerifyIterativeGVN || !((n)->is_dead()))) failed: can not use dead node hotspot / compiler 0
JDK-8238765 3 PhaseCFG::schedule_pinned_nodes cannot handle precedence edges from unmatched CFG nodes correctly hotspot / compiler 0
JDK-8239000 4 handle ContendedPaddingWidth in vm_version_ppc hotspot / runtime 0
JDK-8239142 3 C2\'s UseUniqueSubclasses optimization is broken for array accesses hotspot / compiler 0
JDK-8239224 4 libproc_impl.c previous_thr may be used uninitialized warning hotspot / svc-agent 0
JDK-8239456 4 [win][x86] vtable stub generation: assert failure (code size estimate) hotspot / compiler 0
JDK-8239462 4 jdk.hotspot.agent misses some ReleaseStringUTFChars calls in case of early returns hotspot / svc-agent 0
JDK-8239557 4 [TESTBUG] VeryEarlyAssertTest.java validating \"END.\" marker at lastline is not always true hotspot / runtime 0
JDK-8239787 3 AArch64: String.indexOf may incorrectly handle empty strings. hotspot / runtime 0
JDK-8239852 3 java/util/concurrent tests fail with -XX:+VerifyGraphEdges: assert(!VerifyGraphEdges) failed: verification should have failed hotspot / compiler 0
JDK-8239915 4 Zero VM crashes when handling dynamic constant hotspot / runtime 0